Third Party Copy test summary

FTS SERVER fts.usatlas.bnl.gov

Wed Jul 6 19:07:43 CEST 2022 - TEST HISTORY<

Green if Pull and Push tansfers have been completed successfully, Yellow if at least a Pull or a Push transfer have been completed successfully, Red if Pull and Push tansfers failed

DESTINATION

S

O

U

R

C

E

CNAF-TMP-SE

DESY-TMP-SE

IN2P3CC-TMP-SE

KIT-TMP-SE

Napoli-TMP-SE

CESNET-TMP-SE

IPHC-TMP-SE

LAL-TMP-SE

Pisa-TMP-SE

ROMA3-TMP-SE

Frascati-TMP-SE

CYFRONET-TMP-SE

ULAKBIM-TMP-SE

KEK-DEV-TMP-SE

SIGNET-TMP-SE

Torino-TMP-SE

MPPMU-TMP-SE

HEPHY-TMP-SE

NTUCC-TMP-SE

BNL-TMP-SE

UVic-TMP-SE1

UVic-TMP-SE-DYNA

Australia-SE

IHEP-TMP-SE

CNAF-TMP-SE

FINISEHD FINISEHD FINISEHD FINISEHD FINISEHD FINISEHD FINISEHD FINISEHD FINISEHD FINISEHD FINISEHD FINISEHD FINISEHD FINISEHD FINISEHD FINISEHD Pull FINISHED FINISEHD FINISEHD Push FINISHED ERROR ERROR Push FINISHED

DESY-TMP-SE

FINISEHD

FINISEHD FINISEHD FINISEHD FINISEHD FINISEHD FINISEHD FINISEHD FINISEHD FINISEHD FINISEHD ERROR FINISEHD FINISEHD FINISEHD FINISEHD FINISEHD FINISEHD FINISEHD Push FINISHED ERROR ERROR ACTIVE FAILED

IN2P3CC-TMP-SE

FINISEHD FINISEHD

FINISEHD FINISEHD FINISEHD FINISEHD FINISEHD FINISEHD FINISEHD FINISEHD FINISEHD Push FINISHED FINISEHD FINISEHD FINISEHD FINISEHD FINISEHD FINISEHD FINISEHD ERROR ERROR ERROR ERROR

KIT-TMP-SE

FINISEHD FINISEHD FINISEHD

FINISEHD FINISEHD FINISEHD FINISEHD FINISEHD FINISEHD FINISEHD FINISEHD FINISEHD FINISEHD FINISEHD FINISEHD FINISEHD FINISEHD FINISEHD FINISEHD ERROR ERROR ERROR ERROR

Napoli-TMP-SE

FINISEHD FINISEHD FINISEHD FINISEHD

FINISEHD FINISEHD FINISEHD FINISEHD FINISEHD FINISEHD FINISEHD ERROR FINISEHD FINISEHD FINISEHD ACTIVE ACTIVE FINISEHD FINISEHD FINISEHD ERROR Pull FINISHED ERROR ERROR

CESNET-TMP-SE

FINISEHD FINISEHD FINISEHD FINISEHD FINISEHD

FINISEHD FINISEHD FINISEHD FINISEHD FINISEHD FINISEHD Push FINISHED FINISEHD FINISEHD FINISEHD FINISEHD FINISEHD FINISEHD FINISEHD ERROR ERROR ERROR Push FINISHED

IPHC-TMP-SE

FINISEHD FINISEHD FINISEHD FINISEHD FINISEHD FINISEHD

FINISEHD FINISEHD FINISEHD FINISEHD FINISEHD FINISEHD FINISEHD FINISEHD FINISEHD Pull FINISHED FINISEHD FINISEHD FINISEHD ERROR Pull FINISHED ERROR ERROR

LAL-TMP-SE

FINISEHD FINISEHD FINISEHD FINISEHD FINISEHD FINISEHD FINISEHD

FINISEHD FINISEHD FINISEHD FINISEHD Pull FINISHED FINISEHD FINISEHD FINISEHD Pull FINISHED FINISEHD FINISEHD FINISEHD ERROR ERROR ERROR ERROR

Pisa-TMP-SE

FINISEHD FINISEHD FINISEHD FINISEHD FINISEHD FINISEHD FINISEHD FINISEHD

FINISEHD FINISEHD FINISEHD FINISEHD FINISEHD FINISEHD FINISEHD FINISEHD Pull FINISHED ERROR FINISEHD ERROR ERROR ERROR Push FINISHED

ROMA3-TMP-SE

FINISEHD FINISEHD FINISEHD FINISEHD FINISEHD FINISEHD FINISEHD FINISEHD FINISEHD

FINISEHD FINISEHD Push FINISHED FINISEHD FINISEHD FINISEHD FINISEHD Pull FINISHED Push FINISHED FINISEHD Push FINISHED ERROR ERROR ACTIVE FAILED

Frascati-TMP-SE

FINISEHD FINISEHD FINISEHD FINISEHD FINISEHD FINISEHD FINISEHD FINISEHD FINISEHD FINISEHD

FINISEHD Push FINISHED FINISEHD FINISEHD FINISEHD Pull FINISHED FINISEHD FINISEHD FINISEHD ERROR ERROR ERROR ERROR

CYFRONET-TMP-SE

FINISEHD FINISEHD FINISEHD FINISEHD FINISEHD FINISEHD FINISEHD FINISEHD FINISEHD FINISEHD FINISEHD

Push FINISHED FINISEHD FINISEHD FINISEHD Pull FINISHED FINISEHD FINISEHD FINISEHD ERROR Pull FINISHED ERROR ERROR

ULAKBIM-TMP-SE

FINISEHD FINISEHD FINISEHD FINISEHD FINISEHD FINISEHD FINISEHD FINISEHD FINISEHD FINISEHD FINISEHD FINISEHD

FINISEHD FINISEHD FINISEHD ACTIVE ACTIVE FINISEHD FINISEHD FINISEHD ERROR Pull FINISHED ERROR ERROR

KEK-DEV-TMP-SE

FINISEHD FINISEHD FINISEHD FINISEHD FINISEHD FINISEHD FINISEHD FINISEHD FINISEHD FINISEHD FINISEHD FINISEHD Pull FINISHED

FINISEHD FINISEHD Push FINISHED Pull FINISHED FINISEHD FINISEHD Pull FINISHED Pull FINISHED ERROR Push FINISHED

SIGNET-TMP-SE

Pull FINISHED FINISEHD Push FINISHED FINISEHD FINISEHD Push FINISHED FINISEHD FINISEHD Push FINISHED FINISEHD FINISEHD FINISEHD ERROR Push FINISHED

Push FINISHED ACTIVE ACTIVE FINISEHD ACTIVE ACTIVE FINISEHD Push FINISHED ERROR ERROR ERROR

Torino-TMP-SE

Push FINISHED FINISEHD FINISEHD FINISEHD FINISEHD FINISEHD FINISEHD FINISEHD FINISEHD FINISEHD FINISEHD FINISEHD Push FINISHED FINISEHD FINISEHD

FINISEHD Pull FINISHED Push FINISHED Pull FINISHED ERROR Pull FINISHED ERROR Push FINISHED

MPPMU-TMP-SE

FINISEHD FINISEHD FINISEHD FINISEHD FINISEHD FINISEHD FINISEHD FINISEHD FINISEHD FINISEHD FINISEHD FINISEHD ERROR FINISEHD FINISEHD FINISEHD

FINISEHD FINISEHD FINISEHD Pull FINISHED ERROR ERROR ERROR

HEPHY-TMP-SE

FINISEHD FINISEHD FINISEHD FINISEHD FINISEHD FINISEHD FINISEHD FINISEHD FINISEHD Push FINISHED FINISEHD FINISEHD ERROR Push FINISHED FINISEHD FINISEHD FINISEHD

Push FINISHED FINISEHD ERROR Pull FINISHED ERROR Push FINISHED

NTUCC-TMP-SE

FINISEHD FINISEHD FINISEHD FINISEHD FINISEHD FINISEHD FINISEHD FINISEHD FINISEHD FINISEHD FINISEHD FINISEHD Push FINISHED FINISEHD FINISEHD FINISEHD Push FINISHED Push FINISHED

FINISEHD ERROR ERROR ERROR Push FINISHED

BNL-TMP-SE

Pull FINISHED Pull FINISHED Pull FINISHED Pull FINISHED Pull FINISHED Pull FINISHED Pull FINISHED Pull FINISHED Pull FINISHED Pull FINISHED Pull FINISHED Pull FINISHED Pull FINISHED Pull FINISHED Pull FINISHED Pull FINISHED FAILED ACTIVE Pull FINISHED Pull FINISHED

ERROR ERROR ERROR ERROR

UVic-TMP-SE1

FINISEHD FINISEHD FINISEHD FINISEHD FINISEHD FINISEHD FINISEHD FINISEHD FINISEHD FINISEHD FINISEHD FINISEHD Pull FINISHED FINISEHD FINISEHD FINISEHD Push FINISHED FINISEHD Pull FINISHED FINISEHD

Pull FINISHED ERROR Push FINISHED

UVic-TMP-SE-DYNA

Push FINISHED Push FINISHED Push FINISHED Push FINISHED Push FINISHED Push FINISHED Push FINISHED Push FINISHED Push FINISHED Push FINISHED Push FINISHED Push FINISHED ERROR Push FINISHED Push FINISHED Push FINISHED ERROR Push FINISHED Push FINISHED Push FINISHED Push FINISHED

ERROR Push FINISHED

Australia-SE

ERROR ERROR ERROR ERROR ERROR ERROR ERROR ERROR ERROR ERROR ERROR ERROR ERROR ERROR ERROR ERROR ERROR ERROR ERROR ERROR ERROR ERROR

ERROR

IHEP-TMP-SE

Pull FINISHED Pull FINISHED ERROR ERROR ERROR Pull FINISHED ERROR ERROR Pull FINISHED Pull FINISHED ERROR ERROR ERROR Pull FINISHED ERROR Pull FINISHED ERROR Pull FINISHED Pull FINISHED Pull FINISHED ERROR ERROR ERROR

PUSH TEST - DETAILS

DESTINATION

S

O

U

R

C

E

CNAF-TMP-SE

DESY-TMP-SE

IN2P3CC-TMP-SE

KIT-TMP-SE

Napoli-TMP-SE

CESNET-TMP-SE

IPHC-TMP-SE

LAL-TMP-SE

Pisa-TMP-SE

ROMA3-TMP-SE

Frascati-TMP-SE

CYFRONET-TMP-SE

ULAKBIM-TMP-SE

KEK-DEV-TMP-SE

SIGNET-TMP-SE

Torino-TMP-SE

MPPMU-TMP-SE

HEPHY-TMP-SE

NTUCC-TMP-SE

BNL-TMP-SE

UVic-TMP-SE1

UVic-TMP-SE-DYNA

Australia-SE

IHEP-TMP-SE

CNAF-TMP-SE

FINISHED

Duration: 14 seconds

FINISHED

Duration: 10 seconds

FINISHED

Duration: 12 seconds

FINISHED

Duration: 41 seconds

FINISHED

Duration: 11 seconds

FINISHED

Duration: 708 seconds

FINISHED

Duration: 139 seconds

FINISHED

Duration: 11 seconds

FINISHED

Duration: 10 seconds

FINISHED

Duration: 19 seconds

FINISHED

Duration: 61 seconds

FINISHED

Duration: 50 seconds

FINISHED

Duration: 20 seconds

FINISHED

Duration: 86 seconds

FINISHED

Duration: 24 seconds

FINISHED

Duration: 178 seconds

FAILED

Reason: TRANSFER [5] TRANSFER ERROR: Copy failed with mode 3rd push, with error: Transfer failure: SSLException while pushing https://eos.grid.vbc.ac.at:8443/eos/vbc/experiments/belle/TMP/belle/test/TPC/1G-test-push-CNAF-TMP-SE: Connection reset by peer (Write failed)

FINISHED

Duration: 111 seconds

FINISHED

Duration: 26 seconds

FINISHED

Duration: 43 seconds

FAILED

Reason: TRANSFER [5] TRANSFER ERROR: Copy failed with mode 3rd push, with error: Transfer failure: SSLException while pushing https://dynafed02.heprc.uvic.ca:8443/dynafed/TMP/belle/test/TPC/1G-test-push-CNAF-TMP-SE: Broken pipe (Write failed)

FAILED

Reason: TRANSFER [5] TRANSFER ERROR: Copy failed with mode 3rd push, with error: Transfer failure: Error pushing https://dynafed02.heprc.uvic.ca:8443/dynafed/Melbourne/TMP/belle/test/TPC/1G-test-push-CNAF-TMP-SE: 404 status code: 404, reason phrase: Not Found

FINISHED

Duration: 128 seconds

DESY-TMP-SE

FINISHED

Duration: 53 seconds

FINISHED

Duration: 13 seconds

FINISHED

Duration: 8 seconds

FINISHED

Duration: 37 seconds

FINISHED

Duration: 13 seconds

FINISHED

Duration: 729 seconds

FINISHED

Duration: 16 seconds

FINISHED

Duration: 20 seconds

FINISHED

Duration: 16 seconds

FINISHED

Duration: 21 seconds

FINISHED

Duration: 32 seconds

FAILED

Reason: TRANSFER [5] TRANSFER ERROR: Copy failed with mode 3rd push, with error: Transfer failure: problem sending data: Connect to torik4.ulakbim.gov.tr:443 [torik4.ulakbim.gov.tr/161.9.255.116, torik4.ulakbim.gov.tr/2001:a98:1e:ff:0:0:0:116] failed: Read timed out; redirections [https://torik4.ulakbim.gov.tr:443/storage8/belle/2022-07-06/1G-test-push-DESY-TMP-SE.1496622.1657124857?sfn=%2Fdpm%2Fulakbim.gov.tr%2Fhome%2Fbelle%2FTMP%2Fbelle%2Ftest%2FTPC%2F1G-test-push-DESY-TMP-SE&token=GytWHTQBAIlw%2F246AqWuPwuHVdA%3D%401657125857%401]\n

FINISHED

Duration: 66 seconds

FINISHED

Duration: 20 seconds

FINISHED

Duration: 25 seconds

FINISHED

Duration: 113 seconds

FINISHED

Duration: 20 seconds

FINISHED

Duration: 167 seconds

FINISHED

Duration: 35 seconds

FINISHED

Duration: 126 seconds

FAILED

Reason: TRANSFER [5] TRANSFER ERROR: Copy failed with mode 3rd push, with error: Transfer failure: rejected PUT: 401 login failed; redirections [https://basilisk02.westgrid.ca:2880/belledisk/TMP/belle/test/TPC/1G-test-push-DESY-TMP-SE]\n

FAILED

Reason: TRANSFER [5] TRANSFER ERROR: Copy failed with mode 3rd push, with error: Transfer failure: rejected PUT: 404 Not Found\n

ACTIVE

Reason:

IN2P3CC-TMP-SE

FINISHED

Duration: 15 seconds

FINISHED

Duration: 12 seconds

FINISHED

Duration: 7 seconds

FINISHED

Duration: 29 seconds

FINISHED

Duration: 8 seconds

FINISHED

Duration: 202 seconds

FINISHED

Duration: 32 seconds

FINISHED

Duration: 18 seconds

FINISHED

Duration: 9 seconds

FINISHED

Duration: 11 seconds

FINISHED

Duration: 33 seconds

FINISHED

Duration: 24 seconds

FINISHED

Duration: 56 seconds

FINISHED

Duration: 10 seconds

FINISHED

Duration: 26 seconds

FINISHED

Duration: 1203 seconds

FINISHED

Duration: 15 seconds

FINISHED

Duration: 208 seconds

FINISHED

Duration: 35 seconds

FAILED

Reason: TRANSFER [5] TRANSFER ERROR: Copy failed with mode 3rd push, with error: Transfer failure: rejected PUT: 500 No such file or directory: 000051CEABA18F684AD4AF7CEF190D357531; redirections [http://206.12.48.242:22236/pnfs/westgrid.uvic.ca/data/belle/belledisk/TMP/belle/test/TPC/1G-test-push-IN2P3CC-TMP-SE?dcache-http-uuid=18c94c06-8bfc-4abd-8efc-1d344a4a7ab0]\n

FAILED

Reason: TRANSFER [5] TRANSFER ERROR: Copy failed with mode 3rd push, with error: Transfer failure: rejected PUT: 401 login failed; redirections [https://basilisk02.westgrid.ca:2880/belledisk/TMP/belle/test/TPC/1G-test-push-IN2P3CC-TMP-SE]\n

FAILED

Reason: TRANSFER [5] TRANSFER ERROR: Copy failed with mode 3rd push, with error: Transfer failure: rejected PUT: 404 Not Found\n

FAILED

Reason: TRANSFER [5] TRANSFER ERROR: Copy failed with mode 3rd push, with error: Transfer failure: rejected PUT: 403 Forbidden; redirections [https://dpmbelle01.ihep.ac.cn:443/storage/belle01_01/belle/2022-07-07/1G-test-push-IN2P3CC-TMP-SE.1858254.1657124968?sfn=%2Fdpm%2Fihep.ac.cn%2Fhome%2Fbelle%2FTMP%2Fbelle%2Ftest%2FTPC%2F1G-test-push-IN2P3CC-TMP-SE&token=%2Fd3hUCn%2BaKtZKkuS4GxMJHJfybg%3D%401657125968%401]\n

KIT-TMP-SE

FINISHED

Duration: 15 seconds

FINISHED

Duration: 11 seconds

FINISHED

Duration: 9 seconds

FINISHED

Duration: 28 seconds

FINISHED

Duration: 6 seconds

FINISHED

Duration: 480 seconds

FINISHED

Duration: 12 seconds

FINISHED

Duration: 14 seconds

FINISHED

Duration: 16 seconds

FINISHED

Duration: 15 seconds

FINISHED

Duration: 52 seconds

FINISHED

Duration: 21 seconds

FINISHED

Duration: 56 seconds

FINISHED

Duration: 14 seconds

FINISHED

Duration: 26 seconds

FINISHED

Duration: 1010 seconds

FINISHED

Duration: 29 seconds

FINISHED

Duration: 306 seconds

FINISHED

Duration: 35 seconds

FAILED

Reason: TRANSFER [5] TRANSFER ERROR: Copy failed with mode 3rd push, with error: Transfer failure: rejected PUT: 500 No such file or directory: 0000E73BF14140A14A6DBDFAF282BA60EF16; redirections [http://206.12.48.242:20237/pnfs/westgrid.uvic.ca/data/belle/belledisk/TMP/belle/test/TPC/1G-test-push-KIT-TMP-SE?dcache-http-uuid=94844397-9255-41e6-848a-3d9b01d93b15]\n

FAILED

Reason: TRANSFER [5] TRANSFER ERROR: Copy failed with mode 3rd push, with error: Transfer failure: rejected PUT: 401 login failed; redirections [https://basilisk02.westgrid.ca:2880/belledisk/TMP/belle/test/TPC/1G-test-push-KIT-TMP-SE]\n

FAILED

Reason: TRANSFER [5] TRANSFER ERROR: Copy failed with mode 3rd push, with error: Transfer failure: rejected PUT: 404 Not Found\n

FAILED

Reason: TRANSFER [5] TRANSFER ERROR: Copy failed with mode 3rd push, with error: Transfer failure: rejected PUT: 403 Forbidden; redirections [https://dpmbelle01.ihep.ac.cn:443/storage/belle01_02/belle/2022-07-07/1G-test-push-KIT-TMP-SE.1858300.1657125061?sfn=%2Fdpm%2Fihep.ac.cn%2Fhome%2Fbelle%2FTMP%2Fbelle%2Ftest%2FTPC%2F1G-test-push-KIT-TMP-SE&token=50cM5WMKNeUOkuj9Yx9nodAGgYI%3D%401657126061%401]\n

Napoli-TMP-SE

FINISHED

Duration: 27 seconds

FINISHED

Duration: 42 seconds

FINISHED

Duration: 13 seconds

FINISHED

Duration: 28 seconds

FINISHED

Duration: 27 seconds

FINISHED

Duration: 648 seconds

FINISHED

Duration: 168 seconds

FINISHED

Duration: 14 seconds

FINISHED

Duration: 9 seconds

FINISHED

Duration: 6 seconds

FINISHED

Duration: 68 seconds

FAILED

Reason: TRANSFER [5] TRANSFER ERROR: Copy failed with mode 3rd push, with error: Transfer failure: Remote copy failed with status code 0: \n

FINISHED

Duration: 83 seconds

FINISHED

Duration: 26 seconds

FINISHED

Duration: 24 seconds

ACTIVE

Reason:

FINISHED

Duration: 19 seconds

FINISHED

Duration: 194 seconds

FINISHED

Duration: 51 seconds

FAILED

Reason: TRANSFER [5] TRANSFER ERROR: Copy failed with mode 3rd push, with error: Transfer failure: Remote copy failed with status code 500: Temporary Redirect\n

FAILED

Reason: TRANSFER [5] TRANSFER ERROR: Copy failed with mode 3rd push, with error: Transfer failure: Remote copy failed with status code 401: \n

FAILED

Reason: TRANSFER [5] TRANSFER ERROR: Copy failed with mode 3rd push, with error: Transfer failure: Remote copy failed with status code 404: \n

FAILED

Reason: TRANSFER [5] TRANSFER ERROR: Copy failed with mode 3rd push, with error: Transfer failure: Remote copy failed with status code 403: \n

CESNET-TMP-SE

FINISHED

Duration: 24 seconds

FINISHED

Duration: 11 seconds

FINISHED

Duration: 8 seconds

FINISHED

Duration: 7 seconds

FINISHED

Duration: 19 seconds

FINISHED

Duration: 490 seconds

FINISHED

Duration: 185 seconds

FINISHED

Duration: 17 seconds

FINISHED

Duration: 10 seconds

FINISHED

Duration: 20 seconds

FINISHED

Duration: 35 seconds

FINISHED

Duration: 24 seconds

FINISHED

Duration: 23 seconds

FINISHED

Duration: 9 seconds

FINISHED

Duration: 25 seconds

FINISHED

Duration: 1082 seconds

FINISHED

Duration: 10 seconds

FINISHED

Duration: 35 seconds

FINISHED

Duration: 31 seconds

FAILED

Reason: TRANSFER [5] TRANSFER ERROR: Copy failed with mode 3rd push, with error: Transfer failure: rejected PUT: 500 No such file or directory: 0000EC21B1D09CB94DDBB4B8EAF90BA3E3E3; redirections [http://206.12.48.242:22921/pnfs/westgrid.uvic.ca/data/belle/belledisk/TMP/belle/test/TPC/1G-test-push-CESNET-TMP-SE?dcache-http-uuid=ff68a345-19a3-4d5c-90e2-2b7effb430e9]\n

FAILED

Reason: TRANSFER [5] TRANSFER ERROR: Copy failed with mode 3rd push, with error: Transfer failure: rejected PUT: 401 login failed; redirections [https://basilisk02.westgrid.ca:2880/belledisk/TMP/belle/test/TPC/1G-test-push-CESNET-TMP-SE]\n

FAILED

Reason: TRANSFER [5] TRANSFER ERROR: Copy failed with mode 3rd push, with error: Transfer failure: rejected PUT: 404 Not Found\n

FINISHED

Duration: 74 seconds

IPHC-TMP-SE

FINISHED

Duration: 25 seconds

FINISHED

Duration: 72 seconds

FINISHED

Duration: 6 seconds

FINISHED

Duration: 13 seconds

FINISHED

Duration: 32 seconds

FINISHED

Duration: 12 seconds

FINISHED

Duration: 7 seconds

FINISHED

Duration: 16 seconds

FINISHED

Duration: 12 seconds

FINISHED

Duration: 14 seconds

FINISHED

Duration: 39 seconds

FINISHED

Duration: 29 seconds

FINISHED

Duration: 74 seconds

FINISHED

Duration: 15 seconds

FINISHED

Duration: 23 seconds

ACTIVE

Reason:

FINISHED

Duration: 17 seconds

FINISHED

Duration: 188 seconds

FINISHED

Duration: 47 seconds

FAILED

Reason: TRANSFER [5] TRANSFER ERROR: Copy failed with mode 3rd push, with error: Transfer failure: Remote copy failed with status code 500: Temporary Redirect\n

FAILED

Reason: TRANSFER [5] TRANSFER ERROR: Copy failed with mode 3rd push, with error: Transfer failure: Remote copy failed with status code 401: \n

FAILED

Reason: TRANSFER [5] TRANSFER ERROR: Copy failed with mode 3rd push, with error: Transfer failure: Remote copy failed with status code 404: \n

FAILED

Reason: TRANSFER [5] TRANSFER ERROR: Copy failed with mode 3rd push, with error: Transfer failure: Remote copy failed with status code 403: \n

LAL-TMP-SE

FINISHED

Duration: 25 seconds

FINISHED

Duration: 16 seconds

FINISHED

Duration: 6 seconds

FINISHED

Duration: 10 seconds

FINISHED

Duration: 16 seconds

FINISHED

Duration: 12 seconds

FINISHED

Duration: 286 seconds

FINISHED

Duration: 15 seconds

FINISHED

Duration: 12 seconds

FINISHED

Duration: 18 seconds

FINISHED

Duration: 37 seconds

FAILED

Reason: TRANSFER [5] TRANSFER ERROR: Copy failed with mode 3rd push, with error: Transfer failure: Remote copy failed with status code 0: \n

FINISHED

Duration: 73 seconds

FINISHED

Duration: 13 seconds

FINISHED

Duration: 24 seconds

ACTIVE

Reason:

FINISHED

Duration: 19 seconds

FINISHED

Duration: 204 seconds

FINISHED

Duration: 45 seconds

FAILED

Reason: TRANSFER [5] TRANSFER ERROR: Copy failed with mode 3rd push, with error: Transfer failure: Remote copy failed with status code 500: Temporary Redirect\n

FAILED

Reason: TRANSFER [5] TRANSFER ERROR: Copy failed with mode 3rd push, with error: Transfer failure: Remote copy failed with status code 401: \n

FAILED

Reason: TRANSFER [5] TRANSFER ERROR: Copy failed with mode 3rd push, with error: Transfer failure: Remote copy failed with status code 404: \n

FAILED

Reason: TRANSFER [5] TRANSFER ERROR: Copy failed with mode 3rd push, with error: Transfer failure: Remote copy failed with status code 403: \n

Pisa-TMP-SE

FINISHED

Duration: 14 seconds

FINISHED

Duration: 18 seconds

FINISHED

Duration: 12 seconds

FINISHED

Duration: 16 seconds

FINISHED

Duration: 14 seconds

FINISHED

Duration: 14 seconds

FINISHED

Duration: 60 seconds

FINISHED

Duration: 25 seconds

FINISHED

Duration: 6 seconds

FINISHED

Duration: 11 seconds

FINISHED

Duration: 55 seconds

FINISHED

Duration: 54 seconds

FINISHED

Duration: 11 seconds

FINISHED

Duration: 78 seconds

FINISHED

Duration: 25 seconds

FINISHED

Duration: 15 seconds

FAILED

Reason: TRANSFER [5] TRANSFER ERROR: Copy failed with mode 3rd push, with error: Transfer failure: SocketException while pushing https://eos.grid.vbc.ac.at:8443/eos/vbc/experiments/belle/TMP/belle/test/TPC/1G-test-push-Pisa-TMP-SE: Connection reset by peer (Write failed)

FAILED

Reason: TRANSFER [5] TRANSFER ERROR: Copy failed with mode 3rd push, with error: Transfer failure: SocketTimeoutException while pushing https://belle2grid3.cc.ntu.edu.tw/belle/TMP/belle/test/TPC/1G-test-push-Pisa-TMP-SE: Read timed out

FINISHED

Duration: 30 seconds

FAILED

Reason: TRANSFER [5] TRANSFER ERROR: Copy failed with mode 3rd push, with error: Transfer failure: Error pushing https://basilisk02.westgrid.ca:2880/belledisk/TMP/belle/test/TPC/1G-test-push-Pisa-TMP-SE: 500 status code: 500, reason phrase: Server Error

FAILED

Reason: TRANSFER [5] TRANSFER ERROR: Copy failed with mode 3rd push, with error: Transfer failure: SocketException while pushing https://dynafed02.heprc.uvic.ca:8443/dynafed/TMP/belle/test/TPC/1G-test-push-Pisa-TMP-SE: Broken pipe (Write failed)

FAILED

Reason: TRANSFER [5] TRANSFER ERROR: Copy failed with mode 3rd push, with error: Transfer failure: Error pushing https://dynafed02.heprc.uvic.ca:8443/dynafed/Melbourne/TMP/belle/test/TPC/1G-test-push-Pisa-TMP-SE: 404 status code: 404, reason phrase: Not Found

FINISHED

Duration: 143 seconds

ROMA3-TMP-SE

FINISHED

Duration: 14 seconds

FINISHED

Duration: 17 seconds

FINISHED

Duration: 10 seconds

FINISHED

Duration: 14 seconds

FINISHED

Duration: 28 seconds

FINISHED

Duration: 14 seconds

FINISHED

Duration: 601 seconds

FINISHED

Duration: 35 seconds

FINISHED

Duration: 21 seconds

FINISHED

Duration: 10 seconds

FINISHED

Duration: 62 seconds

FINISHED

Duration: 47 seconds

FINISHED

Duration: 36 seconds

FINISHED

Duration: 78 seconds

FINISHED

Duration: 27 seconds

FINISHED

Duration: 191 seconds

FAILED

Reason: TRANSFER [5] TRANSFER ERROR: Copy failed with mode 3rd push, with error: Transfer failure: SSLException while pushing https://eos.grid.vbc.ac.at:8443/eos/vbc/experiments/belle/TMP/belle/test/TPC/1G-test-push-ROMA3-TMP-SE: Write error: ssl=0x7f8b4800c868: I/O error during system call, Connection reset by peer

FINISHED

Duration: 128 seconds

FINISHED

Duration: 29 seconds

FINISHED

Duration: 38 seconds

FAILED

Reason: TRANSFER [5] TRANSFER ERROR: Copy failed with mode 3rd push, with error: Transfer failure: SSLException while pushing https://dynafed02.heprc.uvic.ca:8443/dynafed/TMP/belle/test/TPC/1G-test-push-ROMA3-TMP-SE: Write error: ssl=0x7f8c8481b8b8: I/O error during system call, Broken pipe

FAILED

Reason: TRANSFER [5] TRANSFER ERROR: Copy failed with mode 3rd push, with error: Transfer failure: Error pushing https://dynafed02.heprc.uvic.ca:8443/dynafed/Melbourne/TMP/belle/test/TPC/1G-test-push-ROMA3-TMP-SE: 404 status code: 404, reason phrase: Not Found

ACTIVE

Reason:

Frascati-TMP-SE

FINISHED

Duration: 24 seconds

FINISHED

Duration: 50 seconds

FINISHED

Duration: 15 seconds

FINISHED

Duration: 33 seconds

FINISHED

Duration: 34 seconds

FINISHED

Duration: 43 seconds

FINISHED

Duration: 497 seconds

FINISHED

Duration: 165 seconds

FINISHED

Duration: 19 seconds

FINISHED

Duration: 7 seconds

FINISHED

Duration: 61 seconds

FINISHED

Duration: 37 seconds

FINISHED

Duration: 99 seconds

FINISHED

Duration: 17 seconds

FINISHED

Duration: 24 seconds

ACTIVE

Reason:

FINISHED

Duration: 40 seconds

FINISHED

Duration: 130 seconds

FINISHED

Duration: 73 seconds

FAILED

Reason: TRANSFER [5] TRANSFER ERROR: Copy failed with mode 3rd push, with error: Transfer failure: Remote copy failed with status code 500: Temporary Redirect\n

FAILED

Reason: TRANSFER [5] TRANSFER ERROR: Copy failed with mode 3rd push, with error: Transfer failure: Remote copy failed with status code 401: \n

FAILED

Reason: TRANSFER [5] TRANSFER ERROR: Copy failed with mode 3rd push, with error: Transfer failure: Remote copy failed with status code 404: \n

FAILED

Reason: TRANSFER [5] TRANSFER ERROR: Copy failed with mode 3rd push, with error: Transfer failure: Remote copy failed with status code 403: \n

CYFRONET-TMP-SE

FINISHED

Duration: 219 seconds

FINISHED

Duration: 419 seconds

FINISHED

Duration: 104 seconds

FINISHED

Duration: 134 seconds

FINISHED

Duration: 199 seconds

FINISHED

Duration: 125 seconds

FINISHED

Duration: 649 seconds

FINISHED

Duration: 399 seconds

FINISHED

Duration: 242 seconds

FINISHED

Duration: 234 seconds

FINISHED

Duration: 274 seconds

FINISHED

Duration: 197 seconds

FINISHED

Duration: 320 seconds

FINISHED

Duration: 208 seconds

FINISHED

Duration: 221 seconds

ACTIVE

Reason:

FINISHED

Duration: 101 seconds

FINISHED

Duration: 444 seconds

FINISHED

Duration: 312 seconds

FAILED

Reason: TRANSFER [5] TRANSFER ERROR: Copy failed with mode 3rd push, with error: Transfer failure: Remote copy failed with status code 500: Temporary Redirect\n

FAILED

Reason: TRANSFER [5] TRANSFER ERROR: Copy failed with mode 3rd push, with error: Transfer failure: Remote copy failed with status code 401: \n

FAILED

Reason: TRANSFER [5] TRANSFER ERROR: Copy failed with mode 3rd push, with error: Transfer failure: Remote copy failed with status code 404: \n

FAILED

Reason: TRANSFER [5] TRANSFER ERROR: Copy failed with mode 3rd push, with error: Transfer failure: Remote copy failed with status code 403: \n

ULAKBIM-TMP-SE

FINISHED

Duration: 39 seconds

FINISHED

Duration: 27 seconds

FINISHED

Duration: 25 seconds

FINISHED

Duration: 20 seconds

FINISHED

Duration: 35 seconds

FINISHED

Duration: 20 seconds

FINISHED

Duration: 862 seconds

FINISHED

Duration: 538 seconds

FINISHED

Duration: 31 seconds

FINISHED

Duration: 24 seconds

FINISHED

Duration: 31 seconds

FINISHED

Duration: 47 seconds

FINISHED

Duration: 93 seconds

FINISHED

Duration: 20 seconds

FINISHED

Duration: 30 seconds

ACTIVE

Reason:

FINISHED

Duration: 23 seconds

FINISHED

Duration: 254 seconds

FINISHED

Duration: 111 seconds

FAILED

Reason: TRANSFER [5] TRANSFER ERROR: Copy failed with mode 3rd push, with error: Transfer failure: Remote copy failed with status code 500: \n

FAILED

Reason: TRANSFER [5] TRANSFER ERROR: Copy failed with mode 3rd push, with error: Transfer failure: Remote copy failed with status code 401: \n

FAILED

Reason: TRANSFER [5] TRANSFER ERROR: Copy failed with mode 3rd push, with error: Transfer failure: Remote copy failed with status code 404: \n

FAILED

Reason: TRANSFER [5] TRANSFER ERROR: Copy failed with mode 3rd push, with error: Transfer failure: Remote copy failed with status code 403: \n

KEK-DEV-TMP-SE

FINISHED

Duration: 28 seconds

FINISHED

Duration: 61 seconds

FINISHED

Duration: 64 seconds

FINISHED

Duration: 63 seconds

FINISHED

Duration: 90 seconds

FINISHED

Duration: 62 seconds

FINISHED

Duration: 747 seconds

FINISHED

Duration: 124 seconds

FINISHED

Duration: 11 seconds

FINISHED

Duration: 52 seconds

FINISHED

Duration: 135 seconds

FINISHED

Duration: 134 seconds

FAILED

Reason: TRANSFER [5] TRANSFER ERROR: Copy failed with mode 3rd push, with error: Transfer failure: ConnectTimeoutException while pushing https://torik1.ulakbim.gov.tr:443/dpm/ulakbim.gov.tr/home/belle/TMP/belle/test/TPC/1G-test-push-KEK-DEV-TMP-SE: Connect to torik4.ulakbim.gov.tr:443 [torik4.ulakbim.gov.tr/161.9.255.116, torik4.ulakbim.gov.tr/2001:a98:1e:ff:0:0:0:116] failed: SSL handshake timed out

FINISHED

Duration: 78 seconds

FINISHED

Duration: 66 seconds

FINISHED

Duration: 66 seconds

FAILED

Reason: TRANSFER [5] TRANSFER ERROR: Copy failed with mode 3rd push, with error: Transfer failure: SSLException while pushing https://eos.grid.vbc.ac.at:8443/eos/vbc/experiments/belle/TMP/belle/test/TPC/1G-test-push-KEK-DEV-TMP-SE: Write error: ssl=0x7f5268155228: I/O error during system call, Connection reset by peer

FINISHED

Duration: 73 seconds

FINISHED

Duration: 48 seconds

FAILED

Reason: TRANSFER [5] TRANSFER ERROR: Copy failed with mode 3rd push, with error: Transfer failure: Error pushing https://basilisk02.westgrid.ca:2880/belledisk/TMP/belle/test/TPC/1G-test-push-KEK-DEV-TMP-SE: 500 status code: 500, reason phrase: Server Error

FAILED

Reason: TRANSFER [5] TRANSFER ERROR: Copy failed with mode 3rd push, with error: Transfer failure: SSLException while pushing https://dynafed02.heprc.uvic.ca:8443/dynafed/TMP/belle/test/TPC/1G-test-push-KEK-DEV-TMP-SE: Write error: ssl=0x7fa6d81aa6c8: I/O error during system call, Broken pipe

FAILED

Reason: TRANSFER [5] TRANSFER ERROR: Copy failed with mode 3rd push, with error: Transfer failure: Error pushing https://dynafed02.heprc.uvic.ca:8443/dynafed/Melbourne/TMP/belle/test/TPC/1G-test-push-KEK-DEV-TMP-SE: 404 status code: 404, reason phrase: Not Found

FINISHED

Duration: 58 seconds

SIGNET-TMP-SE

ACTIVE

Reason:

FINISHED

Duration: 1317 seconds

FINISHED

Duration: 345 seconds

FINISHED

Duration: 1389 seconds

FINISHED

Duration: 822 seconds

FINISHED

Duration: 374 seconds

FINISHED

Duration: 1507 seconds

FINISHED

Duration: 1097 seconds

FINISHED

Duration: 739 seconds

FINISHED

Duration: 289 seconds

FINISHED

Duration: 1222 seconds

FINISHED

Duration: 246 seconds

FAILED

Reason: TRANSFER [5] TRANSFER ERROR: Copy failed with mode 3rd push, with error: Transfer failure: problem sending data: Connect to torik4.ulakbim.gov.tr:443 [torik4.ulakbim.gov.tr/2001:a98:1e:ff:0:0:0:116, torik4.ulakbim.gov.tr/161.9.255.116] failed: Read timed out; redirections [https://torik4.ulakbim.gov.tr:443/storage5/belle/2022-07-06/1G-test-push-SIGNET-TMP-SE.1496733.1657125530?sfn=%2Fdpm%2Fulakbim.gov.tr%2Fhome%2Fbelle%2FTMP%2Fbelle%2Ftest%2FTPC%2F1G-test-push-SIGNET-TMP-SE&token=YedQM93hbZrfhRkUom7PCmo9sEg%3D%401657126530%401]\n

FINISHED

Duration: 392 seconds

FINISHED

Duration: 310 seconds

ACTIVE

Reason:

FINISHED

Duration: 362 seconds

ACTIVE

Reason:

FINISHED

Duration: 447 seconds

FINISHED

Duration: 625 seconds

FAILED

Reason: TRANSFER [5] TRANSFER ERROR: Copy failed with mode 3rd push, with error: Transfer failure: rejected PUT: 401 login failed; redirections [https://basilisk02.westgrid.ca:2880/belledisk/TMP/belle/test/TPC/1G-test-push-SIGNET-TMP-SE]\n

FAILED

Reason: TRANSFER [5] TRANSFER ERROR: Copy failed with mode 3rd push, with error: Transfer failure: rejected PUT: 404 Not Found\n

FAILED

Reason: TRANSFER [5] TRANSFER ERROR: Copy failed with mode 3rd push, with error: Transfer failure: rejected PUT: 403 Forbidden; redirections [https://dpmbelle01.ihep.ac.cn:443/storage/belle01_04/belle/2022-07-07/1G-test-push-SIGNET-TMP-SE.1858427.1657125611?sfn=%2Fdpm%2Fihep.ac.cn%2Fhome%2Fbelle%2FTMP%2Fbelle%2Ftest%2FTPC%2F1G-test-push-SIGNET-TMP-SE&token=hgvWa7jTLGbhgGRKT7WY9PhC3p0%3D%401657126611%401]\n

Torino-TMP-SE

FINISHED

Duration: 17 seconds

FINISHED

Duration: 46 seconds

FINISHED

Duration: 9 seconds

FINISHED

Duration: 16 seconds

FINISHED

Duration: 33 seconds

FINISHED

Duration: 14 seconds

FINISHED

Duration: 686 seconds

FINISHED

Duration: 28 seconds

FINISHED

Duration: 14 seconds

FINISHED

Duration: 6 seconds

FINISHED

Duration: 13 seconds

FINISHED

Duration: 72 seconds

FINISHED

Duration: 47 seconds

FINISHED

Duration: 77 seconds

FINISHED

Duration: 84 seconds

FINISHED

Duration: 136 seconds

FAILED

Reason: TRANSFER [5] TRANSFER ERROR: Copy failed with mode 3rd push, with error: Transfer failure: SocketException while pushing https://eos.grid.vbc.ac.at:8443/eos/vbc/experiments/belle/TMP/belle/test/TPC/1G-test-push-Torino-TMP-SE: Connection reset by peer (Write failed)

FINISHED

Duration: 183 seconds

FAILED

Reason: TRANSFER [5] TRANSFER ERROR: Copy failed with mode 3rd push, with error: Transfer failure: SocketTimeoutException while pushing https://dcbldoor.sdcc.bnl.gov:443/pnfs/sdcc.bnl.gov/data/bellediskdata/TMP/belle/test/TPC/1G-test-push-Torino-TMP-SE: Read timed out

FAILED

Reason: TRANSFER [5] TRANSFER ERROR: Copy failed with mode 3rd push, with error: Transfer failure: Error pushing https://basilisk02.westgrid.ca:2880/belledisk/TMP/belle/test/TPC/1G-test-push-Torino-TMP-SE: 500 status code: 500, reason phrase: Server Error

FAILED

Reason: TRANSFER [5] TRANSFER ERROR: Copy failed with mode 3rd push, with error: Transfer failure: SocketException while pushing https://dynafed02.heprc.uvic.ca:8443/dynafed/TMP/belle/test/TPC/1G-test-push-Torino-TMP-SE: Broken pipe (Write failed)

FAILED

Reason: TRANSFER [5] TRANSFER ERROR: Copy failed with mode 3rd push, with error: Transfer failure: Error pushing https://dynafed02.heprc.uvic.ca:8443/dynafed/Melbourne/TMP/belle/test/TPC/1G-test-push-Torino-TMP-SE: 404 status code: 404, reason phrase: Not Found

FINISHED

Duration: 199 seconds

MPPMU-TMP-SE

FINISHED

Duration: 73 seconds

FINISHED

Duration: 29 seconds

FINISHED

Duration: 40 seconds

FINISHED

Duration: 39 seconds

FINISHED

Duration: 35 seconds

FINISHED

Duration: 42 seconds

FINISHED

Duration: 518 seconds

FINISHED

Duration: 132 seconds

FINISHED

Duration: 25 seconds

FINISHED

Duration: 28 seconds

FINISHED

Duration: 16 seconds

FINISHED

Duration: 88 seconds

FAILED

Reason: TRANSFER [5] TRANSFER ERROR: Copy failed with mode 3rd push, with error: Transfer failure: problem sending data: Connect to torik4.ulakbim.gov.tr:443 [torik4.ulakbim.gov.tr/2001:a98:1e:ff:0:0:0:116, torik4.ulakbim.gov.tr/161.9.255.116] failed: Read timed out; redirections [https://torik4.ulakbim.gov.tr:443/storage3/belle/2022-07-06/1G-test-push-MPPMU-TMP-SE.1496674.1657125139?sfn=%2Fdpm%2Fulakbim.gov.tr%2Fhome%2Fbelle%2FTMP%2Fbelle%2Ftest%2FTPC%2F1G-test-push-MPPMU-TMP-SE&token=8TChCiFqIGP%2FBhOdJgrnCEnIDGE%3D%401657126139%401]\n

FINISHED

Duration: 57 seconds

FINISHED

Duration: 21 seconds

FINISHED

Duration: 24 seconds

FINISHED

Duration: 54 seconds

FINISHED

Duration: 65 seconds

FINISHED

Duration: 58 seconds

FAILED

Reason: TRANSFER [5] TRANSFER ERROR: Copy failed with mode 3rd push, with error: Transfer failure: rejected PUT: 500 No such file or directory: 0000D17CDC72896A42EA801EC99EA08EB56A; redirections [http://206.12.48.242:20237/pnfs/westgrid.uvic.ca/data/belle/belledisk/TMP/belle/test/TPC/1G-test-push-MPPMU-TMP-SE?dcache-http-uuid=8ec29125-1058-471b-b974-c22c2d0ff175]\n

FAILED

Reason: TRANSFER [5] TRANSFER ERROR: Copy failed with mode 3rd push, with error: Transfer failure: rejected PUT: 401 login failed; redirections [https://basilisk02.westgrid.ca:2880/belledisk/TMP/belle/test/TPC/1G-test-push-MPPMU-TMP-SE]\n

FAILED

Reason: TRANSFER [5] TRANSFER ERROR: Copy failed with mode 3rd push, with error: Transfer failure: rejected PUT: 404 Not Found\n

FAILED

Reason: TRANSFER [5] TRANSFER ERROR: Copy failed with mode 3rd push, with error: Transfer failure: rejected PUT: 403 Forbidden; redirections [https://dpmbelle01.ihep.ac.cn:443/storage/belle01_04/belle/2022-07-07/1G-test-push-MPPMU-TMP-SE.1858315.1657125122?sfn=%2Fdpm%2Fihep.ac.cn%2Fhome%2Fbelle%2FTMP%2Fbelle%2Ftest%2FTPC%2F1G-test-push-MPPMU-TMP-SE&token=YlwnqzA9wkIO%2FIpUl1Lxlwqi454%3D%401657126122%401]\n

HEPHY-TMP-SE

FINISHED

Duration: 39 seconds

FINISHED

Duration: 16 seconds

FINISHED

Duration: 19 seconds

FINISHED

Duration: 18 seconds

FINISHED

Duration: 33 seconds

FINISHED

Duration: 19 seconds

FINISHED

Duration: 398 seconds

FINISHED

Duration: 20 seconds

FINISHED

Duration: 23 seconds

FINISHED

Duration: 17 seconds

FINISHED

Duration: 17 seconds

FINISHED

Duration: 31 seconds

FAILED

Reason: TRANSFER [5] TRANSFER ERROR: Copy failed with mode 3rd push, with error: Transfer failure: SSL connect error

FINISHED

Duration: 81 seconds

FINISHED

Duration: 17 seconds

FINISHED

Duration: 24 seconds

FINISHED

Duration: 78 seconds

FINISHED

Duration: 264 seconds

FINISHED

Duration: 48 seconds

FAILED

Reason: TRANSFER [5] TRANSFER ERROR: Copy failed with mode 3rd push, with error: Transfer failure: Remote side failed with status code 500

FAILED

Reason: TRANSFER [5] TRANSFER ERROR: Copy failed with mode 3rd push, with error: Transfer failure: Remote side failed with status code 401

FAILED

Reason: TRANSFER [5] TRANSFER ERROR: Copy failed with mode 3rd push, with error: Transfer failure: Remote side failed with status code 404

FINISHED

Duration: 72 seconds

NTUCC-TMP-SE

FINISHED

Duration: 192 seconds

FINISHED

Duration: 265 seconds

FINISHED

Duration: 191 seconds

FINISHED

Duration: 203 seconds

FINISHED

Duration: 204 seconds

FINISHED

Duration: 176 seconds

FINISHED

Duration: 1059 seconds

FINISHED

Duration: 311 seconds

FINISHED

Duration: 179 seconds

FINISHED

Duration: 179 seconds

FINISHED

Duration: 194 seconds

FINISHED

Duration: 199 seconds

FINISHED

Duration: 182 seconds

FINISHED

Duration: 63 seconds

FINISHED

Duration: 192 seconds

FINISHED

Duration: 207 seconds

FINISHED

Duration: 272 seconds

FINISHED

Duration: 160 seconds

FINISHED

Duration: 181 seconds

FAILED

Reason: TRANSFER [5] TRANSFER ERROR: Copy failed with mode 3rd push, with error: Transfer failure: rejected PUT: 500 No such file or directory: 0000866195E1204D44B38D48E44FAC744A68; redirections [http://206.12.48.242:20237/pnfs/westgrid.uvic.ca/data/belle/belledisk/TMP/belle/test/TPC/1G-test-push-NTUCC-TMP-SE?dcache-http-uuid=e7d07467-718c-4568-a24a-d67985dda68a]\n

FAILED

Reason: TRANSFER [5] TRANSFER ERROR: Copy failed with mode 3rd push, with error: Transfer failure: rejected PUT: 401 login failed; redirections [https://basilisk02.westgrid.ca:2880/belledisk/TMP/belle/test/TPC/1G-test-push-NTUCC-TMP-SE]\n

FAILED

Reason: TRANSFER [5] TRANSFER ERROR: Copy failed with mode 3rd push, with error: Transfer failure: rejected PUT: 404 Not Found\n

FINISHED

Duration: 426 seconds

BNL-TMP-SE

FAILED

Reason: TRANSFER [5] TRANSFER ERROR: Copy failed with mode 3rd push, with error: Transfer failure: Failed to select pool: Request to [>PoolManager@dCacheDomain] timed out.\n

FAILED

Reason: TRANSFER [5] TRANSFER ERROR: Copy failed with mode 3rd push, with error: Transfer failure: Failed to select pool: Request to [>PoolManager@dCacheDomain] timed out.\n

FAILED

Reason: TRANSFER [5] TRANSFER ERROR: Copy failed with mode 3rd push, with error: Transfer failure: Failed to select pool: Request to [>PoolManager@dCacheDomain] timed out.\n

FAILED

Reason: TRANSFER [5] TRANSFER ERROR: Copy failed with mode 3rd push, with error: Transfer failure: Failed to select pool: Request to [>PoolManager@dCacheDomain] timed out.\n

FAILED

Reason: TRANSFER [5] TRANSFER ERROR: Copy failed with mode 3rd push, with error: Transfer failure: Failed to select pool: Request to [>PoolManager@dCacheDomain] timed out.\n

FAILED

Reason: TRANSFER [5] TRANSFER ERROR: Copy failed with mode 3rd push, with error: Transfer failure: Failed to select pool: Request to [>PoolManager@dCacheDomain] timed out.\n

FAILED

Reason: TRANSFER [5] TRANSFER ERROR: Copy failed with mode 3rd push, with error: Transfer failure: Failed to select pool: Request to [>PoolManager@dCacheDomain] timed out.\n

FAILED

Reason: TRANSFER [5] TRANSFER ERROR: Copy failed with mode 3rd push, with error: Transfer failure: Failed to select pool: Request to [>PoolManager@dCacheDomain] timed out.\n

FAILED

Reason: TRANSFER [5] TRANSFER ERROR: Copy failed with mode 3rd push, with error: Transfer failure: Failed to select pool: Request to [>PoolManager@dCacheDomain] timed out.\n

FAILED

Reason: TRANSFER [5] TRANSFER ERROR: Copy failed with mode 3rd push, with error: Transfer failure: Failed to select pool: Request to [>PoolManager@dCacheDomain] timed out.\n

FAILED

Reason: TRANSFER [5] TRANSFER ERROR: Copy failed with mode 3rd push, with error: Transfer failure: Failed to select pool: Request to [>PoolManager@dCacheDomain] timed out.\n

FAILED

Reason: TRANSFER [5] TRANSFER ERROR: Copy failed with mode 3rd push, with error: Transfer failure: Failed to select pool: Request to [>PoolManager@dCacheDomain] timed out.\n

FAILED

Reason: TRANSFER [5] TRANSFER ERROR: Copy failed with mode 3rd push, with error: Transfer failure: Failed to select pool: Request to [>PoolManager@dCacheDomain] timed out.\n

FAILED

Reason: TRANSFER [5] TRANSFER ERROR: Copy failed with mode 3rd push, with error: Transfer failure: Failed to select pool: Request to [>PoolManager@dCacheDomain] timed out.\n

FAILED

Reason: TRANSFER [5] TRANSFER ERROR: Copy failed with mode 3rd push, with error: Transfer failure: Failed to select pool: Request to [>PoolManager@dCacheDomain] timed out.\n

FAILED

Reason: TRANSFER [5] TRANSFER ERROR: Copy failed with mode 3rd push, with error: Transfer failure: Failed to select pool: Request to [>PoolManager@dCacheDomain] timed out.\n

FAILED

Reason: TRANSFER [5] TRANSFER ERROR: Copy failed with mode 3rd push, with error: Transfer failure: Failed to select pool: Request to [>PoolManager@dCacheDomain] timed out.\n

FAILED

Reason: TRANSFER [5] TRANSFER ERROR: Copy failed with mode 3rd push, with error: Transfer failure: Failed to select pool: Request to [>PoolManager@dCacheDomain] timed out.\n

FAILED

Reason: TRANSFER [5] TRANSFER ERROR: Copy failed with mode 3rd push, with error: Transfer failure: Failed to select pool: Request to [>PoolManager@dCacheDomain] timed out.\n

FAILED

Reason: TRANSFER [5] TRANSFER ERROR: Copy failed with mode 3rd push, with error: Transfer failure: Failed to select pool: Request to [>PoolManager@dCacheDomain] timed out.\n

FAILED

Reason: TRANSFER [5] TRANSFER ERROR: Copy failed with mode 3rd push, with error: Transfer failure: Failed to select pool: Request to [>PoolManager@dCacheDomain] timed out.\n

FAILED

Reason: TRANSFER [5] TRANSFER ERROR: Copy failed with mode 3rd push, with error: Transfer failure: Failed to select pool: Request to [>PoolManager@dCacheDomain] timed out.\n

FAILED

Reason: TRANSFER [5] TRANSFER ERROR: Copy failed with mode 3rd push, with error: Transfer failure: Failed to select pool: Request to [>PoolManager@dCacheDomain] timed out.\n

UVic-TMP-SE1

FINISHED

Duration: 34 seconds

FINISHED

Duration: 23 seconds

FINISHED

Duration: 21 seconds

FINISHED

Duration: 23 seconds

FINISHED

Duration: 29 seconds

FINISHED

Duration: 15 seconds

FINISHED

Duration: 209 seconds

FINISHED

Duration: 33 seconds

FINISHED

Duration: 7 seconds

FINISHED

Duration: 17 seconds

FINISHED

Duration: 26 seconds

FINISHED

Duration: 31 seconds

FAILED

Reason: TRANSFER [5] TRANSFER ERROR: Copy failed with mode 3rd push, with error: Transfer failure: problem sending data: Read timed out; redirections [https://torik4.ulakbim.gov.tr:443/storage1/belle/2022-07-06/1G-test-push-UVic-TMP-SE1.1496704.1657125391?sfn=%2Fdpm%2Fulakbim.gov.tr%2Fhome%2Fbelle%2FTMP%2Fbelle%2Ftest%2FTPC%2F1G-test-push-UVic-TMP-SE1&token=LH3HREw1EL4A7ryIigD2KV%2B0CWk%3D%401657126391%401]\n

FINISHED

Duration: 10 seconds

FINISHED

Duration: 24 seconds

FINISHED

Duration: 22 seconds

FINISHED

Duration: 73 seconds

FINISHED

Duration: 27 seconds

FAILED

Reason: TRANSFER [5] TRANSFER ERROR: Copy failed with mode 3rd push, with error: Transfer failure: problem sending data: Certificate for doesn't match any of the subject alternative names: [john@hep1.phys.ntu.edu.tw]\n

FINISHED

Duration: 10 seconds

FAILED

Reason: TRANSFER [5] TRANSFER ERROR: Copy failed with mode 3rd push, with error: Transfer failure: rejected PUT: 401 login failed; redirections [https://basilisk02.westgrid.ca:2880/belledisk/TMP/belle/test/TPC/1G-test-push-UVic-TMP-SE1]\n

FAILED

Reason: TRANSFER [5] TRANSFER ERROR: Copy failed with mode 3rd push, with error: Transfer failure: rejected PUT: 404 Not Found\n

FINISHED

Duration: 32 seconds

UVic-TMP-SE-DYNA

FINISHED

Duration: 21 seconds

FINISHED

Duration: 25 seconds

FINISHED

Duration: 105 seconds

FINISHED

Duration: 41 seconds

FINISHED

Duration: 105 seconds

FINISHED

Duration: 21 seconds

FINISHED

Duration: 462 seconds

FINISHED

Duration: 77 seconds

FINISHED

Duration: 80 seconds

FINISHED

Duration: 33 seconds

FINISHED

Duration: 27 seconds

FINISHED

Duration: 32 seconds

FAILED

Reason: TRANSFER [5] TRANSFER ERROR: Copy failed with mode 3rd push, with error: Transfer failure: Remote copy could not be performed (status: 403): \n

FINISHED

Duration: 105 seconds

FINISHED

Duration: 52 seconds

FINISHED

Duration: 36 seconds

FAILED

Reason: TRANSFER [5] TRANSFER ERROR: Copy failed with mode 3rd push, with error: Transfer failure: Remote copy could not be performed (status: 110): \n

FINISHED

Duration: 27 seconds

FINISHED

Duration: 275 seconds

FINISHED

Duration: 12 seconds

FINISHED

Duration: 28 seconds

FAILED

Reason: TRANSFER [5] TRANSFER ERROR: Copy failed with mode 3rd push, with error: Transfer failure: Remote copy could not be performed (status: 404): \n

FINISHED

Duration: 76 seconds

Australia-SE

FAILED

Reason: SOURCE [2] Result HTTP 404 : File not found after 1 attempts

FAILED

Reason: SOURCE [2] Result HTTP 404 : File not found after 1 attempts

FAILED

Reason: SOURCE [2] Result HTTP 404 : File not found after 1 attempts

FAILED

Reason: SOURCE [2] Result HTTP 404 : File not found after 1 attempts

FAILED

Reason: SOURCE [2] Result HTTP 404 : File not found after 1 attempts

FAILED

Reason: SOURCE [2] Result HTTP 404 : File not found after 1 attempts

FAILED

Reason: SOURCE [2] Result HTTP 404 : File not found after 1 attempts

FAILED

Reason: SOURCE [2] Result HTTP 404 : File not found after 1 attempts

FAILED

Reason: SOURCE [2] Result HTTP 404 : File not found after 1 attempts

FAILED

Reason: SOURCE [2] Result HTTP 404 : File not found after 1 attempts

FAILED

Reason: SOURCE [2] Result HTTP 404 : File not found after 1 attempts

FAILED

Reason: SOURCE [2] Result HTTP 404 : File not found after 1 attempts

FAILED

Reason: SOURCE [2] Result HTTP 404 : File not found after 1 attempts

FAILED

Reason: SOURCE [2] Result HTTP 404 : File not found after 1 attempts

FAILED

Reason: SOURCE [2] Result HTTP 404 : File not found after 1 attempts

FAILED

Reason: SOURCE [2] Result HTTP 404 : File not found after 1 attempts

FAILED

Reason: SOURCE [2] Result HTTP 404 : File not found after 1 attempts

FAILED

Reason: SOURCE [2] Result HTTP 404 : File not found after 1 attempts

FAILED

Reason: SOURCE [2] Result HTTP 404 : File not found after 1 attempts

FAILED

Reason: SOURCE [2] Result HTTP 404 : File not found after 1 attempts

FAILED

Reason: SOURCE [2] Result HTTP 404 : File not found after 1 attempts

FAILED

Reason: SOURCE [2] Result HTTP 404 : File not found after 1 attempts

FAILED

Reason: SOURCE [2] Result HTTP 404 : File not found after 1 attempts

IHEP-TMP-SE

FAILED

Reason: TRANSFER [1] TRANSFER ERROR: Copy failed with mode 3rd push, with error: copy HTTP 403 : Permission refused

FAILED

Reason: TRANSFER [1] TRANSFER ERROR: Copy failed with mode 3rd push, with error: copy HTTP 403 : Permission refused

FAILED

Reason: TRANSFER [1] TRANSFER ERROR: Copy failed with mode 3rd push, with error: copy HTTP 403 : Permission refused

FAILED

Reason: TRANSFER [1] TRANSFER ERROR: Copy failed with mode 3rd push, with error: copy HTTP 403 : Permission refused

FAILED

Reason: TRANSFER [1] TRANSFER ERROR: Copy failed with mode 3rd push, with error: copy HTTP 403 : Permission refused

FAILED

Reason: TRANSFER [1] TRANSFER ERROR: Copy failed with mode 3rd push, with error: copy HTTP 403 : Permission refused

FAILED

Reason: TRANSFER [1] TRANSFER ERROR: Copy failed with mode 3rd push, with error: copy HTTP 403 : Permission refused

FAILED

Reason: TRANSFER [1] TRANSFER ERROR: Copy failed with mode 3rd push, with error: copy HTTP 403 : Permission refused

FAILED

Reason: TRANSFER [1] TRANSFER ERROR: Copy failed with mode 3rd push, with error: copy HTTP 403 : Permission refused

FAILED

Reason: TRANSFER [1] TRANSFER ERROR: Copy failed with mode 3rd push, with error: copy HTTP 403 : Permission refused

FAILED

Reason: TRANSFER [1] TRANSFER ERROR: Copy failed with mode 3rd push, with error: copy HTTP 403 : Permission refused

FAILED

Reason: TRANSFER [1] TRANSFER ERROR: Copy failed with mode 3rd push, with error: copy HTTP 403 : Permission refused

FAILED

Reason: TRANSFER [1] TRANSFER ERROR: Copy failed with mode 3rd push, with error: copy HTTP 403 : Permission refused

FAILED

Reason: TRANSFER [1] TRANSFER ERROR: Copy failed with mode 3rd push, with error: copy HTTP 403 : Permission refused

FAILED

Reason: TRANSFER [1] TRANSFER ERROR: Copy failed with mode 3rd push, with error: copy HTTP 403 : Permission refused

FAILED

Reason: TRANSFER [1] TRANSFER ERROR: Copy failed with mode 3rd push, with error: copy HTTP 403 : Permission refused

FAILED

Reason: TRANSFER [1] TRANSFER ERROR: Copy failed with mode 3rd push, with error: copy HTTP 403 : Permission refused

FAILED

Reason: TRANSFER [1] TRANSFER ERROR: Copy failed with mode 3rd push, with error: copy HTTP 403 : Permission refused

FAILED

Reason: TRANSFER [1] TRANSFER ERROR: Copy failed with mode 3rd push, with error: copy HTTP 403 : Permission refused

FAILED

Reason: TRANSFER [1] TRANSFER ERROR: Copy failed with mode 3rd push, with error: copy HTTP 403 : Permission refused

FAILED

Reason: TRANSFER [1] TRANSFER ERROR: Copy failed with mode 3rd push, with error: copy HTTP 403 : Permission refused

FAILED

Reason: TRANSFER [1] TRANSFER ERROR: Copy failed with mode 3rd push, with error: copy HTTP 403 : Permission refused

FAILED

Reason: TRANSFER [1] TRANSFER ERROR: Copy failed with mode 3rd push, with error: copy HTTP 403 : Permission refused

PULL TEST - DETAILS

DESTINATION

S

O

U

R

C

E

CNAF-TMP-SE

DESY-TMP-SE

IN2P3CC-TMP-SE

KIT-TMP-SE

Napoli-TMP-SE

CESNET-TMP-SE

IPHC-TMP-SE

LAL-TMP-SE

Pisa-TMP-SE

ROMA3-TMP-SE

Frascati-TMP-SE

CYFRONET-TMP-SE

ULAKBIM-TMP-SE

KEK-DEV-TMP-SE

SIGNET-TMP-SE

Torino-TMP-SE

MPPMU-TMP-SE

HEPHY-TMP-SE

NTUCC-TMP-SE

BNL-TMP-SE

UVic-TMP-SE1

UVic-TMP-SE-DYNA

Australia-SE

IHEP-TMP-SE

CNAF-TMP-SE

FINISHED

Duration: 15 seconds

FINISHED

Duration: 9 seconds

FINISHED

Duration: 12 seconds

FINISHED

Duration: 8 seconds

FINISHED

Duration: 7 seconds

FINISHED

Duration: 428 seconds

FINISHED

Duration: 18 seconds

FINISHED

Duration: 26 seconds

FINISHED

Duration: 14 seconds

FINISHED

Duration: 9 seconds

FINISHED

Duration: 30 seconds

FINISHED

Duration: 27 seconds

FINISHED

Duration: 20 seconds

FINISHED

Duration: 8 seconds

FINISHED

Duration: 13 seconds

FINISHED

Duration: 51 seconds

FINISHED

Duration: 15 seconds

FINISHED

Duration: 34 seconds

FINISHED

Duration: 28 seconds

FAILED

Reason: TRANSFER [5] TRANSFER ERROR: Copy failed with mode 3rd pull, with error: Transfer failure: Post-processing failed: No such file or directory: 00008FB6403D82D44C959B75451E313CF245\n

FAILED

Reason: TRANSFER [5] TRANSFER ERROR: Copy failed with mode 3rd pull, with error: Transfer failure: Remote copy could not be performed (status: 5): \n

FAILED

Reason: TRANSFER [2] TRANSFER ERROR: Copy failed with mode 3rd pull, with error: copy HTTP 404 : File not found

FAILED

Reason: TRANSFER [1] TRANSFER ERROR: Copy failed with mode 3rd pull, with error: copy HTTP 403 : Permission refused

DESY-TMP-SE

FINISHED

Duration: 49 seconds

FINISHED

Duration: 12 seconds

FINISHED

Duration: 11 seconds

FINISHED

Duration: 19 seconds

FINISHED

Duration: 7 seconds

FINISHED

Duration: 804 seconds

FINISHED

Duration: 288 seconds

FINISHED

Duration: 17 seconds

FINISHED

Duration: 17 seconds

FINISHED

Duration: 19 seconds

FINISHED

Duration: 25 seconds

FAILED

Reason: TRANSFER [13] TRANSFER ERROR: Copy failed with mode 3rd pull, with error: copy (Neon): SSL handshake failed: Connection timed out during SSL handshake

FINISHED

Duration: 70 seconds

FINISHED

Duration: 26 seconds

FINISHED

Duration: 17 seconds

FINISHED

Duration: 1102 seconds

FINISHED

Duration: 22 seconds

FINISHED

Duration: 300 seconds

FINISHED

Duration: 37 seconds

FAILED

Reason: TRANSFER [5] TRANSFER ERROR: Copy failed with mode 3rd pull, with error: Transfer failure: Post-processing failed: No such file or directory: 0000F41B46BCB4C94CBF9425F08FB61FF1FB\n

FAILED

Reason: TRANSFER [5] TRANSFER ERROR: Copy failed with mode 3rd pull, with error: Transfer failure: Remote copy could not be performed (status: 409): \n

FAILED

Reason: TRANSFER [2] TRANSFER ERROR: Copy failed with mode 3rd pull, with error: copy HTTP 404 : File not found

FAILED

Reason: TRANSFER [1] TRANSFER ERROR: Copy failed with mode 3rd pull, with error: copy HTTP 403 : Permission refused

IN2P3CC-TMP-SE

FINISHED

Duration: 26 seconds

FINISHED

Duration: 13 seconds

FINISHED

Duration: 8 seconds

FINISHED

Duration: 9 seconds

FINISHED

Duration: 6 seconds

FINISHED

Duration: 333 seconds

FINISHED

Duration: 61 seconds

FINISHED

Duration: 13 seconds

FINISHED

Duration: 11 seconds

FINISHED

Duration: 10 seconds

FINISHED

Duration: 20 seconds

FAILED

Reason: TRANSFER [13] TRANSFER ERROR: Copy failed with mode 3rd pull, with error: copy (Neon): SSL handshake failed: Connection timed out during SSL handshake

FINISHED

Duration: 61 seconds

FINISHED

Duration: 14 seconds

FINISHED

Duration: 11 seconds

FINISHED

Duration: 1099 seconds

FINISHED

Duration: 19 seconds

FINISHED

Duration: 492 seconds

FINISHED

Duration: 36 seconds

FAILED

Reason: TRANSFER [5] TRANSFER ERROR: Copy failed with mode 3rd pull, with error: Transfer failure: Post-processing failed: No such file or directory: 00006F42A2BA30AA4B99BCCBC9029AEAA41D\n

FAILED

Reason: TRANSFER [5] TRANSFER ERROR: Copy failed with mode 3rd pull, with error: Transfer failure: Remote copy could not be performed (status: 409): \n

FAILED

Reason: TRANSFER [2] TRANSFER ERROR: Copy failed with mode 3rd pull, with error: copy HTTP 404 : File not found

FAILED

Reason: TRANSFER [1] TRANSFER ERROR: Copy failed with mode 3rd pull, with error: copy HTTP 403 : Permission refused

KIT-TMP-SE

FINISHED

Duration: 28 seconds

FINISHED

Duration: 19 seconds

FINISHED

Duration: 7 seconds

FINISHED

Duration: 13 seconds

FINISHED

Duration: 7 seconds

FINISHED

Duration: 500 seconds

FINISHED

Duration: 13 seconds

FINISHED

Duration: 17 seconds

FINISHED

Duration: 13 seconds

FINISHED

Duration: 16 seconds

FINISHED

Duration: 27 seconds

FINISHED

Duration: 54 seconds

FINISHED

Duration: 65 seconds

FINISHED

Duration: 17 seconds

FINISHED

Duration: 12 seconds

FINISHED

Duration: 1045 seconds

FINISHED

Duration: 42 seconds

FINISHED

Duration: 378 seconds

FINISHED

Duration: 40 seconds

FAILED

Reason: TRANSFER [5] TRANSFER ERROR: Copy failed with mode 3rd pull, with error: Transfer failure: Post-processing failed: No such file or directory: 00004002E657C94C4A1191B2C05FB36EE4DF\n

FAILED

Reason: TRANSFER [5] TRANSFER ERROR: Copy failed with mode 3rd pull, with error: Transfer failure: Remote copy could not be performed (status: 5): \n

FAILED

Reason: TRANSFER [2] TRANSFER ERROR: Copy failed with mode 3rd pull, with error: copy HTTP 404 : File not found

FAILED

Reason: TRANSFER [1] TRANSFER ERROR: Copy failed with mode 3rd pull, with error: copy HTTP 403 : Permission refused

Napoli-TMP-SE

FINISHED

Duration: 38 seconds

FINISHED

Duration: 19 seconds

FINISHED

Duration: 12 seconds

FINISHED

Duration: 13 seconds

FINISHED

Duration: 13 seconds

FINISHED

Duration: 508 seconds

FINISHED

Duration: 13 seconds

FINISHED

Duration: 15 seconds

FINISHED

Duration: 12 seconds

FINISHED

Duration: 7 seconds

FINISHED

Duration: 35 seconds

FAILED

Reason: TRANSFER [13] TRANSFER ERROR: Copy failed with mode 3rd pull, with error: copy (Neon): SSL handshake failed: Connection timed out during SSL handshake

FINISHED

Duration: 56 seconds

FINISHED

Duration: 19 seconds

FINISHED

Duration: 14 seconds

ACTIVE

Reason:

FINISHED

Duration: 20 seconds

FINISHED

Duration: 234 seconds

FINISHED

Duration: 40 seconds

FAILED

Reason: TRANSFER [5] TRANSFER ERROR: Copy failed with mode 3rd pull, with error: Transfer failure: Post-processing failed: No such file or directory: 0000A6D81EDF44AB4EA89F2CC8C373C6F787\n

FINISHED

Duration: 74 seconds

FAILED

Reason: TRANSFER [2] TRANSFER ERROR: Copy failed with mode 3rd pull, with error: copy HTTP 404 : File not found

FAILED

Reason: TRANSFER [1] TRANSFER ERROR: Copy failed with mode 3rd pull, with error: copy HTTP 403 : Permission refused

CESNET-TMP-SE

FINISHED

Duration: 26 seconds

FINISHED

Duration: 11 seconds

FINISHED

Duration: 9 seconds

FINISHED

Duration: 10 seconds

FINISHED

Duration: 6 seconds

FINISHED

Duration: 415 seconds

FINISHED

Duration: 137 seconds

FINISHED

Duration: 18 seconds

FINISHED

Duration: 11 seconds

FINISHED

Duration: 15 seconds

FINISHED

Duration: 15 seconds

FAILED

Reason: TRANSFER [13] TRANSFER ERROR: Copy failed with mode 3rd pull, with error: copy (Neon): SSL handshake failed: Connection timed out during SSL handshake

FINISHED

Duration: 18 seconds

FINISHED

Duration: 14 seconds

FINISHED

Duration: 13 seconds

FINISHED

Duration: 1009 seconds

FINISHED

Duration: 16 seconds

FINISHED

Duration: 76 seconds

FINISHED

Duration: 28 seconds

FAILED

Reason: TRANSFER [5] TRANSFER ERROR: Copy failed with mode 3rd pull, with error: Transfer failure: Post-processing failed: No such file or directory: 0000E1EFD76B5CB1444A8B600918D42A0D7A\n

FAILED

Reason: TRANSFER [5] TRANSFER ERROR: Copy failed with mode 3rd pull, with error: Transfer failure: Remote copy could not be performed (status: 409): \n

FAILED

Reason: TRANSFER [2] TRANSFER ERROR: Copy failed with mode 3rd pull, with error: copy HTTP 404 : File not found

FAILED

Reason: TRANSFER [1] TRANSFER ERROR: Copy failed with mode 3rd pull, with error: copy HTTP 403 : Permission refused

IPHC-TMP-SE

FINISHED

Duration: 54 seconds

FINISHED

Duration: 29 seconds

FINISHED

Duration: 8 seconds

FINISHED

Duration: 15 seconds

FINISHED

Duration: 13 seconds

FINISHED

Duration: 12 seconds

FINISHED

Duration: 11 seconds

FINISHED

Duration: 22 seconds

FINISHED

Duration: 13 seconds

FINISHED

Duration: 14 seconds

FINISHED

Duration: 54 seconds

FINISHED

Duration: 63 seconds

FINISHED

Duration: 75 seconds

FINISHED

Duration: 14 seconds

FINISHED

Duration: 16 seconds

FINISHED

Duration: 1559 seconds

FINISHED

Duration: 20 seconds

FINISHED

Duration: 393 seconds

FINISHED

Duration: 36 seconds

FAILED

Reason: TRANSFER [5] TRANSFER ERROR: Copy failed with mode 3rd pull, with error: Transfer failure: Post-processing failed: No such file or directory: 0000CDBE15688592452980A0BA8F619F93AB\n

FINISHED

Duration: 74 seconds

FAILED

Reason: TRANSFER [2] TRANSFER ERROR: Copy failed with mode 3rd pull, with error: copy HTTP 404 : File not found

FAILED

Reason: TRANSFER [1] TRANSFER ERROR: Copy failed with mode 3rd pull, with error: copy HTTP 403 : Permission refused

LAL-TMP-SE

FINISHED

Duration: 34 seconds

FINISHED

Duration: 24 seconds

FINISHED

Duration: 9 seconds

FINISHED

Duration: 10 seconds

FINISHED

Duration: 13 seconds

FINISHED

Duration: 10 seconds

FINISHED

Duration: 261 seconds

FINISHED

Duration: 45 seconds

FINISHED

Duration: 14 seconds

FINISHED

Duration: 13 seconds

FINISHED

Duration: 45 seconds

FINISHED

Duration: 57 seconds

FINISHED

Duration: 51 seconds

FINISHED

Duration: 13 seconds

FINISHED

Duration: 15 seconds

FINISHED

Duration: 1683 seconds

FINISHED

Duration: 14 seconds

FINISHED

Duration: 257 seconds

FINISHED

Duration: 31 seconds

FAILED

Reason: TRANSFER [5] TRANSFER ERROR: Copy failed with mode 3rd pull, with error: Transfer failure: Post-processing failed: No such file or directory: 00004DE0C40C9BD544069821B088D6B28A42\n

FAILED

Reason: TRANSFER [5] TRANSFER ERROR: Copy failed with mode 3rd pull, with error: Transfer failure: Remote copy could not be performed (status: 5): \n

FAILED

Reason: TRANSFER [2] TRANSFER ERROR: Copy failed with mode 3rd pull, with error: copy HTTP 404 : File not found

FAILED

Reason: TRANSFER [1] TRANSFER ERROR: Copy failed with mode 3rd pull, with error: copy HTTP 403 : Permission refused

Pisa-TMP-SE

FINISHED

Duration: 31 seconds

FINISHED

Duration: 19 seconds

FINISHED

Duration: 11 seconds

FINISHED

Duration: 15 seconds

FINISHED

Duration: 8 seconds

FINISHED

Duration: 8 seconds

FINISHED

Duration: 31 seconds

FINISHED

Duration: 15 seconds

FINISHED

Duration: 13 seconds

FINISHED

Duration: 7 seconds

FINISHED

Duration: 33 seconds

FINISHED

Duration: 34 seconds

FINISHED

Duration: 13 seconds

FINISHED

Duration: 18 seconds

FINISHED

Duration: 13 seconds

FINISHED

Duration: 10 seconds

FINISHED

Duration: 14 seconds

FAILED

Reason: TRANSFER [5] TRANSFER ERROR: Copy failed with mode 3rd pull, with error: Transfer failure: Truncated chunk ( expected size: 1048576; actual size: 49142)\n

FINISHED

Duration: 31 seconds

FAILED

Reason: TRANSFER [5] TRANSFER ERROR: Copy failed with mode 3rd pull, with error: Transfer failure: Post-processing failed: No such file or directory: 000031B490F699884E429A06285C49505E09\n

FAILED

Reason: TRANSFER [5] TRANSFER ERROR: Copy failed with mode 3rd pull, with error: Transfer failure: Remote copy could not be performed (status: 5): \n

FAILED

Reason: TRANSFER [2] TRANSFER ERROR: Copy failed with mode 3rd pull, with error: copy HTTP 404 : File not found

FAILED

Reason: TRANSFER [1] TRANSFER ERROR: Copy failed with mode 3rd pull, with error: copy HTTP 403 : Permission refused

ROMA3-TMP-SE

FINISHED

Duration: 32 seconds

FINISHED

Duration: 17 seconds

FINISHED

Duration: 10 seconds

FINISHED

Duration: 29 seconds

FINISHED

Duration: 7 seconds

FINISHED

Duration: 8 seconds

FINISHED

Duration: 378 seconds

FINISHED

Duration: 12 seconds

FINISHED

Duration: 15 seconds

FINISHED

Duration: 6 seconds

FINISHED

Duration: 34 seconds

FAILED

Reason: TRANSFER [13] TRANSFER ERROR: Copy failed with mode 3rd pull, with error: copy (Neon): SSL handshake failed: Connection timed out during SSL handshake

FINISHED

Duration: 40 seconds

FINISHED

Duration: 13 seconds

FINISHED

Duration: 14 seconds

FINISHED

Duration: 108 seconds

FINISHED

Duration: 14 seconds

FAILED

Reason: TRANSFER [5] TRANSFER ERROR: Copy failed with mode 3rd pull, with error: Transfer failure: gridsrv-06.roma3.infn.it:8443 failed to respond\n

FINISHED

Duration: 27 seconds

FAILED

Reason: TRANSFER [5] TRANSFER ERROR: Copy failed with mode 3rd pull, with error: Transfer failure: Post-processing failed: No such file or directory: 00006D505B42431544B5967B69DEA2011358\n

FAILED

Reason: TRANSFER [5] TRANSFER ERROR: Copy failed with mode 3rd pull, with error: Transfer failure: Remote copy could not be performed (status: 409): \n

FAILED

Reason: TRANSFER [2] TRANSFER ERROR: Copy failed with mode 3rd pull, with error: copy HTTP 404 : File not found

FAILED

Reason: TRANSFER [1] TRANSFER ERROR: Copy failed with mode 3rd pull, with error: copy HTTP 403 : Permission refused

Frascati-TMP-SE

FINISHED

Duration: 33 seconds

FINISHED

Duration: 21 seconds

FINISHED

Duration: 11 seconds

FINISHED

Duration: 15 seconds

FINISHED

Duration: 8 seconds

FINISHED

Duration: 13 seconds

FINISHED

Duration: 491 seconds

FINISHED

Duration: 17 seconds

FINISHED

Duration: 18 seconds

FINISHED

Duration: 12 seconds

FINISHED

Duration: 59 seconds

FAILED

Reason: TRANSFER [13] TRANSFER ERROR: Copy failed with mode 3rd pull, with error: copy (Neon): SSL handshake failed: Connection timed out during SSL handshake

FINISHED

Duration: 59 seconds

FINISHED

Duration: 20 seconds

FINISHED

Duration: 14 seconds

FINISHED

Duration: 2232 seconds

FINISHED

Duration: 14 seconds

FINISHED

Duration: 161 seconds

FINISHED

Duration: 45 seconds

FAILED

Reason: TRANSFER [5] TRANSFER ERROR: Copy failed with mode 3rd pull, with error: Transfer failure: Post-processing failed: No such file or directory: 00000AF9F11A8C27465EB83DD21E9C6B9E4C\n

FAILED

Reason: TRANSFER [5] TRANSFER ERROR: Copy failed with mode 3rd pull, with error: Transfer failure: Remote copy could not be performed (status: 409): \n

FAILED

Reason: TRANSFER [2] TRANSFER ERROR: Copy failed with mode 3rd pull, with error: copy HTTP 404 : File not found

FAILED

Reason: TRANSFER [1] TRANSFER ERROR: Copy failed with mode 3rd pull, with error: copy HTTP 403 : Permission refused

CYFRONET-TMP-SE

FINISHED

Duration: 102 seconds

FINISHED

Duration: 79 seconds

FINISHED

Duration: 105 seconds

FINISHED

Duration: 120 seconds

FINISHED

Duration: 114 seconds

FINISHED

Duration: 78 seconds

FINISHED

Duration: 482 seconds

FINISHED

Duration: 130 seconds

FINISHED

Duration: 149 seconds

FINISHED

Duration: 99 seconds

FINISHED

Duration: 92 seconds

FAILED

Reason: TRANSFER [13] TRANSFER ERROR: Copy failed with mode 3rd pull, with error: copy (Neon): SSL handshake failed: Connection timed out during SSL handshake

FINISHED

Duration: 126 seconds

FINISHED

Duration: 85 seconds

FINISHED

Duration: 86 seconds

FINISHED

Duration: 1974 seconds

FINISHED

Duration: 90 seconds

FINISHED

Duration: 191 seconds

FINISHED

Duration: 93 seconds

FAILED

Reason: TRANSFER [5] TRANSFER ERROR: Copy failed with mode 3rd pull, with error: Transfer failure: Post-processing failed: No such file or directory: 0000DF0F2310A87848D98CC040CDD90D4715\n

FINISHED

Duration: 204 seconds

FAILED

Reason: TRANSFER [2] TRANSFER ERROR: Copy failed with mode 3rd pull, with error: copy HTTP 404 : File not found

FAILED

Reason: TRANSFER [1] TRANSFER ERROR: Copy failed with mode 3rd pull, with error: copy HTTP 403 : Permission refused

ULAKBIM-TMP-SE

FINISHED

Duration: 32 seconds

FINISHED

Duration: 25 seconds

FINISHED

Duration: 28 seconds

FINISHED

Duration: 28 seconds

FINISHED

Duration: 78 seconds

FINISHED

Duration: 19 seconds

FINISHED

Duration: 764 seconds

FINISHED

Duration: 42 seconds

FINISHED

Duration: 23 seconds

FINISHED

Duration: 21 seconds

FINISHED

Duration: 36 seconds

FINISHED

Duration: 44 seconds

FINISHED

Duration: 62 seconds

FINISHED

Duration: 32 seconds

FINISHED

Duration: 27 seconds

ACTIVE

Reason:

FINISHED

Duration: 22 seconds

FINISHED

Duration: 115 seconds

FINISHED

Duration: 44 seconds

FAILED

Reason: TRANSFER [5] TRANSFER ERROR: Copy failed with mode 3rd pull, with error: Transfer failure: Post-processing failed: No such file or directory: 00003FD3F9B9ED544965BFE10FACDCAE3529\n

FINISHED

Duration: 89 seconds

FAILED

Reason: TRANSFER [2] TRANSFER ERROR: Copy failed with mode 3rd pull, with error: copy HTTP 404 : File not found

FAILED

Reason: TRANSFER [1] TRANSFER ERROR: Copy failed with mode 3rd pull, with error: copy HTTP 403 : Permission refused

KEK-DEV-TMP-SE

FINISHED

Duration: 33 seconds

FINISHED

Duration: 63 seconds

FINISHED

Duration: 63 seconds

FINISHED

Duration: 62 seconds

FINISHED

Duration: 9 seconds

FINISHED

Duration: 10 seconds

FINISHED

Duration: 418 seconds

FINISHED

Duration: 64 seconds

FINISHED

Duration: 18 seconds

FINISHED

Duration: 52 seconds

FINISHED

Duration: 70 seconds

FINISHED

Duration: 72 seconds

FINISHED

Duration: 207 seconds

FINISHED

Duration: 67 seconds

FINISHED

Duration: 66 seconds

ACTIVE

Reason:

FINISHED

Duration: 79 seconds

FINISHED

Duration: 59 seconds

FINISHED

Duration: 70 seconds

FINISHED

Duration: 15 seconds

FINISHED

Duration: 50 seconds

FAILED

Reason: TRANSFER [2] TRANSFER ERROR: Copy failed with mode 3rd pull, with error: copy HTTP 404 : File not found

FAILED

Reason: TRANSFER [1] TRANSFER ERROR: Copy failed with mode 3rd pull, with error: copy HTTP 403 : Permission refused

SIGNET-TMP-SE

FINISHED

Duration: 1139 seconds

FINISHED

Duration: 483 seconds

ACTIVE

Reason:

FINISHED

Duration: 98 seconds

FINISHED

Duration: 870 seconds

ACTIVE

Reason:

FINISHED

Duration: 1511 seconds

FINISHED

Duration: 525 seconds

FAILED

Reason: TRANSFER [5] TRANSFER ERROR: Copy failed with mode 3rd pull, with error: Transfer failure: SocketTimeoutException while fetching https://dcache.ijs.si:2880/pnfs/ijs.si/belle/TMP/belle/test/TPC/1G-test?copy_mode=pull: Read timed out

FINISHED

Duration: 81 seconds

FINISHED

Duration: 143 seconds

FINISHED

Duration: 1144 seconds

FAILED

Reason: TRANSFER [13] TRANSFER ERROR: Copy failed with mode 3rd pull, with error: copy (Neon): SSL handshake failed: Connection timed out during SSL handshake

FAILED

Reason: TRANSFER [5] TRANSFER ERROR: Copy failed with mode 3rd pull, with error: Transfer failure: SocketTimeoutException while fetching https://dcache.ijs.si:2880/pnfs/ijs.si/belle/TMP/belle/test/TPC/1G-test?copy_mode=pull: Read timed out

FAILED

Reason: TRANSFER [5] TRANSFER ERROR: Copy failed with mode 3rd pull, with error: Transfer failure: SocketTimeoutException while fetching https://dcache.ijs.si:2880/pnfs/ijs.si/belle/TMP/belle/test/TPC/1G-test?copy_mode=pull: Read timed out

ACTIVE

Reason:

FINISHED

Duration: 277 seconds

ACTIVE

Reason:

FINISHED

Duration: 1119 seconds

FAILED

Reason: TRANSFER [5] TRANSFER ERROR: Copy failed with mode 3rd pull, with error: Transfer failure: Post-processing failed: No such file or directory: 0000BAF5120DCF2E4F3792075F127094C10D\n

FAILED

Reason: TRANSFER [5] TRANSFER ERROR: Copy failed with mode 3rd pull, with error: Transfer failure: Remote copy could not be performed (status: 409): \n

FAILED

Reason: TRANSFER [2] TRANSFER ERROR: Copy failed with mode 3rd pull, with error: copy HTTP 404 : File not found

FAILED

Reason: TRANSFER [1] TRANSFER ERROR: Copy failed with mode 3rd pull, with error: copy HTTP 403 : Permission refused

Torino-TMP-SE

FINISHED

Duration: 22 seconds

FINISHED

Duration: 10 seconds

FINISHED

Duration: 14 seconds

FINISHED

Duration: 8 seconds

FINISHED

Duration: 10 seconds

FINISHED

Duration: 471 seconds

FINISHED

Duration: 11 seconds

FINISHED

Duration: 21 seconds

FINISHED

Duration: 14 seconds

FINISHED

Duration: 17 seconds

FINISHED

Duration: 31 seconds

FAILED

Reason: TRANSFER [13] TRANSFER ERROR: Copy failed with mode 3rd pull, with error: copy (Neon): SSL handshake failed: Connection timed out during SSL handshake

FINISHED

Duration: 62 seconds

FINISHED

Duration: 15 seconds

FINISHED

Duration: 1628 seconds

FINISHED

Duration: 14 seconds

FAILED

Reason: TRANSFER [5] TRANSFER ERROR: Copy failed with mode 3rd pull, with error: Transfer failure: Truncated chunk ( expected size: 1048576; actual size: 344054)\n

FINISHED

Duration: 52 seconds

FAILED

Reason: TRANSFER [5] TRANSFER ERROR: Copy failed with mode 3rd pull, with error: Transfer failure: Post-processing failed: No such file or directory: 000062562254190F40DFA86EB30D11EA1EB2\n

FINISHED

Duration: 77 seconds

FAILED

Reason: TRANSFER [2] TRANSFER ERROR: Copy failed with mode 3rd pull, with error: copy HTTP 404 : File not found

FAILED

Reason: TRANSFER [1] TRANSFER ERROR: Copy failed with mode 3rd pull, with error: copy HTTP 403 : Permission refused

MPPMU-TMP-SE

FINISHED

Duration: 57 seconds

FINISHED

Duration: 166 seconds

FINISHED

Duration: 16 seconds

FINISHED

Duration: 21 seconds

FINISHED

Duration: 16 seconds

FINISHED

Duration: 10 seconds

FINISHED

Duration: 438 seconds

FINISHED

Duration: 30 seconds

FINISHED

Duration: 43 seconds

FINISHED

Duration: 12 seconds

FINISHED

Duration: 20 seconds

FINISHED

Duration: 18 seconds

FAILED

Reason: TRANSFER [13] TRANSFER ERROR: Copy failed with mode 3rd pull, with error: copy (Neon): SSL handshake failed: Connection timed out during SSL handshake

FINISHED

Duration: 51 seconds

FINISHED

Duration: 15 seconds

FINISHED

Duration: 24 seconds

FINISHED

Duration: 47 seconds

FINISHED

Duration: 207 seconds

FINISHED

Duration: 31 seconds

FINISHED

Duration: 20 seconds

FAILED

Reason: TRANSFER [5] TRANSFER ERROR: Copy failed with mode 3rd pull, with error: Transfer failure: Remote copy could not be performed (status: 5): \n

FAILED

Reason: TRANSFER [2] TRANSFER ERROR: Copy failed with mode 3rd pull, with error: copy HTTP 404 : File not found

FAILED

Reason: TRANSFER [1] TRANSFER ERROR: Copy failed with mode 3rd pull, with error: copy HTTP 403 : Permission refused

HEPHY-TMP-SE

FINISHED

Duration: 32 seconds

FINISHED

Duration: 13 seconds

FINISHED

Duration: 11 seconds

FINISHED

Duration: 11 seconds

FINISHED

Duration: 12 seconds

FINISHED

Duration: 8 seconds

FINISHED

Duration: 355 seconds

FINISHED

Duration: 14 seconds

FINISHED

Duration: 16 seconds

FAILED

Reason: TRANSFER [5] TRANSFER ERROR: Copy failed with mode 3rd pull, with error: Transfer failure: SocketTimeoutException while fetching https://eos.grid.vbc.ac.at:8443/eos/vbc/experiments/belle/TMP/belle/test/TPC/1G-test?copy_mode=pull: Read timed out

FINISHED

Duration: 12 seconds

FINISHED

Duration: 40 seconds

FAILED

Reason: TRANSFER [5] TRANSFER ERROR: Copy failed with mode 3rd pull, with error: Connection terminated abruptly; Status of TPC request unknown

FAILED

Reason: TRANSFER [5] TRANSFER ERROR: Copy failed with mode 3rd pull, with error: Transfer failure: SocketTimeoutException while fetching https://eos.grid.vbc.ac.at:8443/eos/vbc/experiments/belle/TMP/belle/test/TPC/1G-test?copy_mode=pull: Read timed out

FINISHED

Duration: 8 seconds

FINISHED

Duration: 13 seconds

FINISHED

Duration: 73 seconds

FAILED

Reason: TRANSFER [5] TRANSFER ERROR: Copy failed with mode 3rd pull, with error: Transfer failure: fst-1.eos.grid.vbc.ac.at:9001 failed to respond; redirects [https://fst-1.eos.grid.vbc.ac.at:9001/eos/vbc/experiments/belle/TMP/belle/test/TPC/1G-test?encURI=%26cap.sym%3DTU8aiZKgP9JVwZSe2%2FtlKPrdWfk%3D%26cap.msg%3D3nbHSbN5UOFAk%2FeRkrrmP8ZgCi4h4ZJ20MdgUX3KcgxDGkgml3dGoB9L9aO1Jra%2BWFXLNMFOsA0Y6vTnyEEPkDIpvvMHCcUMAilAXJGkd0KiuRG7qAmQbaOhjQEtbvHcAnlzAgKRnJ5LuW29WjB84gdO%2BSG7v%2B0HbQMdrTexB0FEgQsgN4WZHnH88Bv8Ffbn7SoWyuzPznuwFVUGhJLVyay2qOnigg%2FSnHaMQynhKjkJxaEtLT4erpc%2FTE1UVmYEQsLvvb%2F

FINISHED

Duration: 35 seconds

FAILED

Reason: TRANSFER [5] TRANSFER ERROR: Copy failed with mode 3rd pull, with error: Transfer failure: Post-processing failed: No such file or directory: 000088C3221AB1204445806868C376CFB93A\n

FINISHED

Duration: 74 seconds

FAILED

Reason: TRANSFER [2] TRANSFER ERROR: Copy failed with mode 3rd pull, with error: copy HTTP 404 : File not found

FAILED

Reason: TRANSFER [1] TRANSFER ERROR: Copy failed with mode 3rd pull, with error: copy HTTP 403 : Permission refused

NTUCC-TMP-SE

FINISHED

Duration: 120 seconds

FINISHED

Duration: 185 seconds

FINISHED

Duration: 149 seconds

FINISHED

Duration: 186 seconds

FINISHED

Duration: 168 seconds

FINISHED

Duration: 131 seconds

FINISHED

Duration: 1087 seconds

FINISHED

Duration: 1721 seconds

FINISHED

Duration: 105 seconds

FINISHED

Duration: 161 seconds

FINISHED

Duration: 183 seconds

FINISHED

Duration: 165 seconds

FAILED

Reason: TRANSFER [13] TRANSFER ERROR: Copy failed with mode 3rd pull, with error: copy (Neon): SSL handshake failed: Connection timed out during SSL handshake

FINISHED

Duration: 45 seconds

FINISHED

Duration: 167 seconds

FINISHED

Duration: 188 seconds

ACTIVE

Reason:

FAILED

Reason: TRANSFER [5] TRANSFER ERROR: Copy failed with mode 3rd pull, with error: Transfer failure: Transferred a partial file

FINISHED

Duration: 136 seconds

FAILED

Reason: TRANSFER [5] TRANSFER ERROR: Copy failed with mode 3rd pull, with error: Transfer failure: Certificate for doesn't match any of the subject alternative names: [john@hep1.phys.ntu.edu.tw]\n

FAILED

Reason: TRANSFER [2] DESTINATION OVERWRITE DavPosix::unlink HTTP 404 : File not found with url davs://dynafed02.heprc.uvic.ca:8443/dynafed/TMP/belle/test/TPC/1G-test-pull-NTUCC-TMP-SE

FAILED

Reason: TRANSFER [2] TRANSFER ERROR: Copy failed with mode 3rd pull, with error: copy HTTP 404 : File not found

FAILED

Reason: TRANSFER [1] TRANSFER ERROR: Copy failed with mode 3rd pull, with error: copy HTTP 403 : Permission refused

BNL-TMP-SE

FINISHED

Duration: 33 seconds

FINISHED

Duration: 39 seconds

FINISHED

Duration: 36 seconds

FINISHED

Duration: 37 seconds

FINISHED

Duration: 43 seconds

FINISHED

Duration: 15 seconds

FINISHED

Duration: 447 seconds

FINISHED

Duration: 544 seconds

FINISHED

Duration: 23 seconds

FINISHED

Duration: 29 seconds

FINISHED

Duration: 46 seconds

FINISHED

Duration: 48 seconds

FINISHED

Duration: 114 seconds

FINISHED

Duration: 31 seconds

FINISHED

Duration: 43 seconds

FINISHED

Duration: 39 seconds

ACTIVE

Reason:

FINISHED

Duration: 41 seconds

FINISHED

Duration: 40 seconds

FAILED

Reason: TRANSFER [5] TRANSFER ERROR: Copy failed with mode 3rd pull, with error: Transfer failure: Post-processing failed: No such file or directory: 0000552B47B40C784940B5A76DA58972DB01\n

FAILED

Reason: TRANSFER [5] TRANSFER ERROR: Copy failed with mode 3rd pull, with error: Transfer failure: Remote copy could not be performed (status: 5): \n

FAILED

Reason: TRANSFER [2] TRANSFER ERROR: Copy failed with mode 3rd pull, with error: copy HTTP 404 : File not found

FAILED

Reason: TRANSFER [1] TRANSFER ERROR: Copy failed with mode 3rd pull, with error: copy HTTP 403 : Permission refused

UVic-TMP-SE1

FINISHED

Duration: 54 seconds

FINISHED

Duration: 23 seconds

FINISHED

Duration: 22 seconds

FINISHED

Duration: 25 seconds

FINISHED

Duration: 31 seconds

FINISHED

Duration: 17 seconds

FINISHED

Duration: 295 seconds

FINISHED

Duration: 132 seconds

FINISHED

Duration: 10 seconds

FINISHED

Duration: 19 seconds

FINISHED

Duration: 24 seconds

FINISHED

Duration: 28 seconds

FINISHED

Duration: 30 seconds

FINISHED

Duration: 18 seconds

FINISHED

Duration: 26 seconds

FINISHED

Duration: 24 seconds

FAILED

Reason: TRANSFER [5] TRANSFER ERROR: Copy failed with mode 3rd pull, with error: Connection terminated abruptly; Status of TPC request unknown

FINISHED

Duration: 31 seconds

FINISHED

Duration: 471 seconds

FINISHED

Duration: 9 seconds

FINISHED

Duration: 4 seconds

FAILED

Reason: TRANSFER [2] TRANSFER ERROR: Copy failed with mode 3rd pull, with error: copy HTTP 404 : File not found

FAILED

Reason: TRANSFER [1] TRANSFER ERROR: Copy failed with mode 3rd pull, with error: copy HTTP 403 : Permission refused

UVic-TMP-SE-DYNA

FAILED

Reason: TRANSFER [5] TRANSFER ERROR: Copy failed with mode 3rd pull, with error: Transfer failure: Error fetching https://dynafed02.heprc.uvic.ca:8443/dynafed/TMP/belle/test/TPC/1G-test?copy_mode=pull: 401 status code: 401, reason phrase: login failed

FAILED

Reason: TRANSFER [5] TRANSFER ERROR: Copy failed with mode 3rd pull, with error: Transfer failure: rejected GET: 401 login failed; redirects [https://basilisk02.westgrid.ca:2880/belledisk/TMP/belle/test/TPC/1G-test]\n

FAILED

Reason: TRANSFER [5] TRANSFER ERROR: Copy failed with mode 3rd pull, with error: Transfer failure: rejected GET: 401 login failed; redirects [https://basilisk02.westgrid.ca:2880/belledisk/TMP/belle/test/TPC/1G-test]\n

FAILED

Reason: TRANSFER [5] TRANSFER ERROR: Copy failed with mode 3rd pull, with error: Transfer failure: rejected GET: 401 login failed; redirects [https://basilisk02.westgrid.ca:2880/belledisk/TMP/belle/test/TPC/1G-test]\n

FAILED

Reason: TRANSFER [5] TRANSFER ERROR: Copy failed with mode 3rd pull, with error: Transfer failure: Remote copy failed with status code 401: Found\n

FAILED

Reason: TRANSFER [5] TRANSFER ERROR: Copy failed with mode 3rd pull, with error: Transfer failure: rejected GET: 401 login failed; redirects [https://basilisk02.westgrid.ca:2880/belledisk/TMP/belle/test/TPC/1G-test]\n

FAILED

Reason: TRANSFER [5] TRANSFER ERROR: Copy failed with mode 3rd pull, with error: Transfer failure: Remote copy failed with status code 401: Found\n

FAILED

Reason: TRANSFER [5] TRANSFER ERROR: Copy failed with mode 3rd pull, with error: Transfer failure: Remote copy failed with status code 401: Found\n

FAILED

Reason: TRANSFER [5] TRANSFER ERROR: Copy failed with mode 3rd pull, with error: Transfer failure: Error fetching https://dynafed02.heprc.uvic.ca:8443/dynafed/TMP/belle/test/TPC/1G-test?copy_mode=pull: 401 status code: 401, reason phrase: login failed

FAILED

Reason: TRANSFER [5] TRANSFER ERROR: Copy failed with mode 3rd pull, with error: Transfer failure: Error fetching https://dynafed02.heprc.uvic.ca:8443/dynafed/TMP/belle/test/TPC/1G-test?copy_mode=pull: 401 status code: 401, reason phrase: login failed

FAILED

Reason: TRANSFER [5] TRANSFER ERROR: Copy failed with mode 3rd pull, with error: Transfer failure: Remote copy failed with status code 401: Found\n

FAILED

Reason: TRANSFER [5] TRANSFER ERROR: Copy failed with mode 3rd pull, with error: Transfer failure: Remote copy failed with status code 401: Found\n

FAILED

Reason: TRANSFER [13] TRANSFER ERROR: Copy failed with mode 3rd pull, with error: copy (Neon): SSL handshake failed: Connection timed out during SSL handshake

FAILED

Reason: TRANSFER [5] TRANSFER ERROR: Copy failed with mode 3rd pull, with error: Transfer failure: Error fetching https://dynafed02.heprc.uvic.ca:8443/dynafed/TMP/belle/test/TPC/1G-test?copy_mode=pull: 401 status code: 401, reason phrase: login failed

FAILED

Reason: TRANSFER [5] TRANSFER ERROR: Copy failed with mode 3rd pull, with error: Transfer failure: rejected GET: 401 login failed; redirects [https://basilisk02.westgrid.ca:2880/belledisk/TMP/belle/test/TPC/1G-test]\n

FAILED

Reason: TRANSFER [5] TRANSFER ERROR: Copy failed with mode 3rd pull, with error: Transfer failure: Error fetching https://dynafed02.heprc.uvic.ca:8443/dynafed/TMP/belle/test/TPC/1G-test?copy_mode=pull: 401 status code: 401, reason phrase: login failed

FAILED

Reason: TRANSFER [5] TRANSFER ERROR: Copy failed with mode 3rd pull, with error: Transfer failure: rejected GET: 401 login failed; redirects [https://basilisk02.westgrid.ca:2880/belledisk/TMP/belle/test/TPC/1G-test]\n

FAILED

Reason: TRANSFER [5] TRANSFER ERROR: Copy failed with mode 3rd pull, with error: Transfer failure: Remote side failed with status code 401; error message: " Error 401 login failed

HTTP ERROR 401

Problem accessing /belledisk/TMP/belle/test/TPC/1G-test. Reason:

    login failed


Powered by Jetty:// 9.4.18.v20190429
"

FAILED

Reason: TRANSFER [5] TRANSFER ERROR: Copy failed with mode 3rd pull, with error: Transfer failure: rejected GET: 401 login failed; redirects [https://basilisk02.westgrid.ca:2880/belledisk/TMP/belle/test/TPC/1G-test]\n

FAILED

Reason: TRANSFER [5] TRANSFER ERROR: Copy failed with mode 3rd pull, with error: Transfer failure: rejected GET: 401 login failed; redirects [https://basilisk02.westgrid.ca:2880/belledisk/TMP/belle/test/TPC/1G-test]\n

FAILED

Reason: TRANSFER [5] TRANSFER ERROR: Copy failed with mode 3rd pull, with error: Transfer failure: rejected GET: 401 login failed; redirects [https://basilisk02.westgrid.ca:2880/belledisk/TMP/belle/test/TPC/1G-test]\n

FAILED

Reason: TRANSFER [2] TRANSFER ERROR: Copy failed with mode 3rd pull, with error: copy HTTP 404 : File not found

FAILED

Reason: TRANSFER [1] TRANSFER ERROR: Copy failed with mode 3rd pull, with error: copy HTTP 403 : Permission refused

Australia-SE

FAILED

Reason: SOURCE [2] Result HTTP 404 : File not found after 1 attempts

FAILED

Reason: SOURCE [2] Result HTTP 404 : File not found after 1 attempts

FAILED

Reason: SOURCE [2] Result HTTP 404 : File not found after 1 attempts

FAILED

Reason: SOURCE [2] Result HTTP 404 : File not found after 1 attempts

FAILED

Reason: SOURCE [2] Result HTTP 404 : File not found after 1 attempts

FAILED

Reason: SOURCE [2] Result HTTP 404 : File not found after 1 attempts

FAILED

Reason: SOURCE [2] Result HTTP 404 : File not found after 1 attempts

FAILED

Reason: SOURCE [2] Result HTTP 404 : File not found after 1 attempts

FAILED

Reason: SOURCE [2] Result HTTP 404 : File not found after 1 attempts

FAILED

Reason: SOURCE [2] Result HTTP 404 : File not found after 1 attempts

FAILED

Reason: SOURCE [2] Result HTTP 404 : File not found after 1 attempts

FAILED

Reason: SOURCE [2] Result HTTP 404 : File not found after 1 attempts

FAILED

Reason: SOURCE [2] Result HTTP 404 : File not found after 1 attempts

FAILED

Reason: SOURCE [2] Result HTTP 404 : File not found after 1 attempts

FAILED

Reason: SOURCE [2] Result HTTP 404 : File not found after 1 attempts

FAILED

Reason: SOURCE [2] Result HTTP 404 : File not found after 1 attempts

FAILED

Reason: SOURCE [2] Result HTTP 404 : File not found after 1 attempts

FAILED

Reason: SOURCE [2] Result HTTP 404 : File not found after 1 attempts

FAILED

Reason: SOURCE [2] Result HTTP 404 : File not found after 1 attempts

FAILED

Reason: SOURCE [2] Result HTTP 404 : File not found after 1 attempts

FAILED

Reason: SOURCE [2] Result HTTP 404 : File not found after 1 attempts

FAILED

Reason: SOURCE [2] Result HTTP 404 : File not found after 1 attempts

FAILED

Reason: SOURCE [2] Result HTTP 404 : File not found after 1 attempts

IHEP-TMP-SE

FINISHED

Duration: 53 seconds

FINISHED

Duration: 69 seconds

FAILED

Reason: TRANSFER [5] TRANSFER ERROR: Copy failed with mode 3rd pull, with error: Transfer failure: rejected GET: 403 Forbidden; redirects [https://dpmbelle01.ihep.ac.cn:443/storage/belle01_02/belle/2021-11-10/1G-test.7014487.1636474089?token=1Aokp61GcXcdA7MwaYUri7%2BohnY%3D%401657125181%400&dav_sfn=%2Fdpm%2Fihep.ac.cn%2Fhome%2Fbelle%2FTMP%2Fbelle%2Ftest%2FTPC%2F1G-test&dav_user=%2FDC%3Dorg%2FDC%3Dterena%2FDC%3Dtcs%2FC%3DIT%2FO%3DIstituto%20Nazionale%20di%20Fisica%20Nucleare%2FCN%3DSilvio%20Pardi%20spardi%40infn.it]\n

FAILED

Reason: TRANSFER [5] TRANSFER ERROR: Copy failed with mode 3rd pull, with error: Transfer failure: rejected GET: 403 Forbidden; redirects [https://dpmbelle01.ihep.ac.cn:443/storage/belle01_02/belle/2021-11-10/1G-test.7014487.1636474089?token=YNBFsN8Puj69WrrPu64RoIIb%2FUE%3D%401657125185%400&dav_sfn=%2Fdpm%2Fihep.ac.cn%2Fhome%2Fbelle%2FTMP%2Fbelle%2Ftest%2FTPC%2F1G-test&dav_user=%2FDC%3Dorg%2FDC%3Dterena%2FDC%3Dtcs%2FC%3DIT%2FO%3DIstituto%20Nazionale%20di%20Fisica%20Nucleare%2FCN%3DSilvio%20Pardi%20spardi%40infn.it]\n

FAILED

Reason: TRANSFER [5] TRANSFER ERROR: Copy failed with mode 3rd pull, with error: Transfer failure: Remote copy failed with status code 403: Found\n

FINISHED

Duration: 49 seconds

FAILED

Reason: TRANSFER [5] TRANSFER ERROR: Copy failed with mode 3rd pull, with error: Transfer failure: Remote copy failed with status code 403: Found\n

FAILED

Reason: TRANSFER [5] TRANSFER ERROR: Copy failed with mode 3rd pull, with error: Transfer failure: Remote copy failed with status code 403: Found\n

FINISHED

Duration: 54 seconds

FINISHED

Duration: 137 seconds

FAILED

Reason: TRANSFER [5] TRANSFER ERROR: Copy failed with mode 3rd pull, with error: Transfer failure: Remote copy failed with status code 403: Found\n

FAILED

Reason: TRANSFER [5] TRANSFER ERROR: Copy failed with mode 3rd pull, with error: Transfer failure: Remote copy failed with status code 403: Found\n

FAILED

Reason: TRANSFER [13] TRANSFER ERROR: Copy failed with mode 3rd pull, with error: copy (Neon): SSL handshake failed: Connection timed out during SSL handshake

FINISHED

Duration: 48 seconds

FAILED

Reason: TRANSFER [5] TRANSFER ERROR: Copy failed with mode 3rd pull, with error: Transfer failure: rejected GET: 403 Forbidden; redirects [https://dpmbelle01.ihep.ac.cn:443/storage/belle01_02/belle/2021-11-10/1G-test.7014487.1636474089?token=v2zxHKjwM84to98W7Kf6UCI%2Fd5s%3D%401657125193%400&dav_sfn=%2Fdpm%2Fihep.ac.cn%2Fhome%2Fbelle%2FTMP%2Fbelle%2Ftest%2FTPC%2F1G-test&dav_user=%2FDC%3Dorg%2FDC%3Dterena%2FDC%3Dtcs%2FC%3DIT%2FO%3DIstituto%20Nazionale%20di%20Fisica%20Nucleare%2FCN%3DSilvio%20Pardi%20spardi%40infn.it]\n

FINISHED

Duration: 127 seconds

FAILED

Reason: TRANSFER [5] TRANSFER ERROR: Copy failed with mode 3rd pull, with error: Transfer failure: rejected GET: 403 Forbidden; redirects [https://dpmbelle01.ihep.ac.cn:443/storage/belle01_02/belle/2021-11-10/1G-test.7014487.1636474089?token=Jl67eXu4UnG7A288urg6z8gYBCI%3D%401657125187%400&dav_sfn=%2Fdpm%2Fihep.ac.cn%2Fhome%2Fbelle%2FTMP%2Fbelle%2Ftest%2FTPC%2F1G-test&dav_user=%2FDC%3Dorg%2FDC%3Dterena%2FDC%3Dtcs%2FC%3DIT%2FO%3DIstituto%20Nazionale%20di%20Fisica%20Nucleare%2FCN%3DSilvio%20Pardi%20spardi%40infn.it]\n

FINISHED

Duration: 76 seconds

FINISHED

Duration: 416 seconds

FINISHED

Duration: 108 seconds

FAILED

Reason: TRANSFER [5] TRANSFER ERROR: Copy failed with mode 3rd pull, with error: Transfer failure: Post-processing failed: No such file or directory: 0000D028499B355940F98DA5A6EF579F58BE\n

FAILED

Reason: TRANSFER [5] TRANSFER ERROR: Copy failed with mode 3rd pull, with error: Transfer failure: Remote copy could not be performed (status: 5): \n

FAILED

Reason: TRANSFER [2] TRANSFER ERROR: Copy failed with mode 3rd pull, with error: copy HTTP 404 : File not found