Third Party Copy test summary

FTS SERVER fts.usatlas.bnl.gov

Wed Jul 6 08:01:58 CEST 2022 - TEST HISTORY<

Green if Pull and Push tansfers have been completed successfully, Yellow if at least a Pull or a Push transfer have been completed successfully, Red if Pull and Push tansfers failed

DESTINATION

S

O

U

R

C

E

CNAF-TMP-SE

DESY-TMP-SE

IN2P3CC-TMP-SE

KIT-TMP-SE

Napoli-TMP-SE

UVic-TMP-SE1

CESNET-TMP-SE

IPHC-TMP-SE

LAL-TMP-SE

Pisa-TMP-SE

ROMA3-TMP-SE

Frascati-TMP-SE

CYFRONET-TMP-SE

ULAKBIM-TMP-SE

KEK-DEV-TMP-SE

SIGNET-TMP-SE

Torino-TMP-SE

MPPMU-TMP-SE

HEPHY-TMP-SE

NTUCC-TMP-SE

BNL-TMP-SE

UVic-TMP-SE-DYNA

Australia-SE

IHEP-TMP-SE

CNAF-TMP-SE

FINISEHD FINISEHD FINISEHD FINISEHD Pull FINISHED FINISEHD FINISEHD FINISEHD FINISEHD FINISEHD FINISEHD FINISEHD FINISEHD FINISEHD FINISEHD FINISEHD FINISEHD Pull FINISHED Push FINISHED FINISEHD ERROR ERROR ACTIVE FAILED

DESY-TMP-SE

FINISEHD

FINISEHD FINISEHD FINISEHD ERROR FINISEHD FINISEHD FINISEHD FINISEHD FINISEHD FINISEHD FINISEHD FINISEHD FINISEHD FINISEHD FINISEHD FINISEHD FINISEHD FINISEHD FINISEHD ERROR ERROR Push FINISHED

IN2P3CC-TMP-SE

FINISEHD FINISEHD

FINISEHD FINISEHD ERROR FINISEHD FINISEHD FINISEHD FINISEHD FINISEHD FINISEHD FINISEHD FINISEHD FINISEHD FINISEHD FINISEHD FINISEHD FINISEHD FINISEHD FINISEHD ERROR ERROR ERROR

KIT-TMP-SE

FINISEHD FINISEHD FINISEHD

FINISEHD ERROR FINISEHD FINISEHD FINISEHD FINISEHD FINISEHD FINISEHD FINISEHD FINISEHD FINISEHD FINISEHD FINISEHD FINISEHD FINISEHD FINISEHD FINISEHD ERROR ERROR ERROR

Napoli-TMP-SE

FINISEHD FINISEHD FINISEHD FINISEHD

Push FINISHED FINISEHD FINISEHD FINISEHD FINISEHD FINISEHD FINISEHD FINISEHD FINISEHD FINISEHD FINISEHD FINISEHD Pull FINISHED FINISEHD FINISEHD FINISEHD Pull FINISHED ERROR ERROR

UVic-TMP-SE1

FINISEHD FINISEHD FINISEHD FINISEHD FINISEHD

FINISEHD FINISEHD FINISEHD FINISEHD FINISEHD FINISEHD FINISEHD FINISEHD FINISEHD FINISEHD FINISEHD FINISEHD FINISEHD Pull FINISHED FINISEHD Pull FINISHED ERROR Push FINISHED

CESNET-TMP-SE

FINISEHD FINISEHD FINISEHD FINISEHD FINISEHD ERROR

FINISEHD FINISEHD FINISEHD FINISEHD FINISEHD FINISEHD FINISEHD FINISEHD FINISEHD FINISEHD FINISEHD FINISEHD FINISEHD FINISEHD Pull FINISHED ERROR ACTIVE FAILED

IPHC-TMP-SE

FINISEHD FINISEHD FINISEHD FINISEHD FINISEHD ERROR FINISEHD

FINISEHD FINISEHD FINISEHD FINISEHD FINISEHD FINISEHD FINISEHD FINISEHD FINISEHD FINISEHD FINISEHD FINISEHD FINISEHD Pull FINISHED ERROR ERROR

LAL-TMP-SE

FINISEHD FINISEHD FINISEHD FINISEHD FINISEHD ERROR FINISEHD FINISEHD

FINISEHD FINISEHD FINISEHD FINISEHD FINISEHD FINISEHD FINISEHD FINISEHD FINISEHD FINISEHD FINISEHD FINISEHD ERROR ERROR ERROR

Pisa-TMP-SE

FINISEHD FINISEHD FINISEHD FINISEHD FINISEHD ERROR Pull FINISHED FINISEHD FINISEHD

FINISEHD FINISEHD FINISEHD FINISEHD FINISEHD FINISEHD FINISEHD FINISEHD Pull FINISHED Push FINISHED Pull FINISHED ERROR ERROR Push FINISHED

ROMA3-TMP-SE

FINISEHD FINISEHD FINISEHD FINISEHD FINISEHD ERROR FINISEHD FINISEHD FINISEHD FINISEHD

FINISEHD FINISEHD FINISEHD FINISEHD FINISEHD FINISEHD FINISEHD Pull FINISHED Push FINISHED FINISEHD ERROR ERROR ACTIVE FAILED

Frascati-TMP-SE

FINISEHD FINISEHD FINISEHD FINISEHD FINISEHD ERROR FINISEHD FINISEHD FINISEHD FINISEHD FINISEHD

FINISEHD FINISEHD FINISEHD FINISEHD FINISEHD FINISEHD FINISEHD FINISEHD FINISEHD ERROR ERROR ERROR

CYFRONET-TMP-SE

FINISEHD FINISEHD FINISEHD FINISEHD FINISEHD ERROR FINISEHD FINISEHD FINISEHD FINISEHD FINISEHD FINISEHD

FINISEHD FINISEHD FINISEHD FINISEHD FINISEHD FINISEHD FINISEHD FINISEHD ERROR ERROR ERROR

ULAKBIM-TMP-SE

FINISEHD FINISEHD FINISEHD FINISEHD FINISEHD ERROR FINISEHD FINISEHD FINISEHD FINISEHD FINISEHD FINISEHD FINISEHD

FINISEHD FINISEHD FINISEHD ACTIVE ACTIVE FINISEHD FINISEHD FINISEHD ERROR ERROR ERROR

KEK-DEV-TMP-SE

FINISEHD FINISEHD FINISEHD FINISEHD FINISEHD Push FINISHED FINISEHD FINISEHD FINISEHD FINISEHD FINISEHD FINISEHD FINISEHD FINISEHD

FINISEHD FINISEHD ACTIVE ACTIVE Pull FINISHED FINISEHD FINISEHD ERROR ERROR Push FINISHED

SIGNET-TMP-SE

FINISEHD FINISEHD FINISEHD FINISEHD FINISEHD ERROR FINISEHD FINISEHD FINISEHD FINISEHD FINISEHD FINISEHD FINISEHD FINISEHD FINISEHD

Push FINISHED ACTIVE ACTIVE FINISEHD FINISEHD FINISEHD ERROR ERROR ERROR

Torino-TMP-SE

FINISEHD FINISEHD FINISEHD FINISEHD FINISEHD Push FINISHED FINISEHD FINISEHD FINISEHD FINISEHD FINISEHD FINISEHD FINISEHD FINISEHD FINISEHD FINISEHD

FINISEHD Pull FINISHED FINISEHD FINISEHD ERROR ERROR ACTIVE FAILED

MPPMU-TMP-SE

FINISEHD FINISEHD FINISEHD FINISEHD FINISEHD Push FINISHED FINISEHD FINISEHD FINISEHD FINISEHD FINISEHD FINISEHD FINISEHD FINISEHD FINISEHD FINISEHD FINISEHD

FINISEHD FINISEHD FINISEHD ERROR ERROR ERROR

HEPHY-TMP-SE

Push FINISHED FINISEHD FINISEHD FINISEHD FINISEHD Pull FINISHED FINISEHD FINISEHD FINISEHD Push FINISHED Push FINISHED FINISEHD FINISEHD FINISEHD FINISEHD FINISEHD Push FINISHED FINISEHD

Push FINISHED Pull FINISHED ERROR ERROR ACTIVE FAILED

NTUCC-TMP-SE

FINISEHD FINISEHD FINISEHD FINISEHD FINISEHD ERROR FINISEHD FINISEHD FINISEHD FINISEHD FINISEHD FINISEHD FINISEHD FINISEHD FINISEHD FINISEHD FINISEHD FINISEHD Push FINISHED

FINISEHD Pull FINISHED ERROR Push FINISHED

BNL-TMP-SE

Pull FINISHED Pull FINISHED Pull FINISHED Pull FINISHED Pull FINISHED ERROR Pull FINISHED Pull FINISHED Pull FINISHED Pull FINISHED Pull FINISHED Pull FINISHED Pull FINISHED Pull FINISHED Pull FINISHED Pull FINISHED Pull FINISHED FAILED ACTIVE Pull FINISHED Pull FINISHED

Pull FINISHED ERROR ERROR

UVic-TMP-SE-DYNA

Push FINISHED Push FINISHED Push FINISHED Push FINISHED Push FINISHED Push FINISHED Push FINISHED Push FINISHED Push FINISHED Push FINISHED Push FINISHED Push FINISHED Push FINISHED Push FINISHED Push FINISHED Push FINISHED Push FINISHED ERROR Push FINISHED Push FINISHED Push FINISHED

ERROR Push FINISHED

Australia-SE

ERROR ERROR ERROR ERROR ERROR ERROR ERROR ERROR ERROR ERROR ERROR ERROR ERROR ERROR ERROR ERROR ERROR ERROR ERROR ERROR ERROR ERROR

ERROR

IHEP-TMP-SE

Pull FINISHED Pull FINISHED ERROR ERROR ERROR ERROR Pull FINISHED ERROR ERROR Pull FINISHED Pull FINISHED ERROR ERROR ERROR Pull FINISHED ERROR Pull FINISHED ERROR Pull FINISHED Pull FINISHED Pull FINISHED ERROR ERROR

PUSH TEST - DETAILS

DESTINATION

S

O

U

R

C

E

CNAF-TMP-SE

DESY-TMP-SE

IN2P3CC-TMP-SE

KIT-TMP-SE

Napoli-TMP-SE

UVic-TMP-SE1

CESNET-TMP-SE

IPHC-TMP-SE

LAL-TMP-SE

Pisa-TMP-SE

ROMA3-TMP-SE

Frascati-TMP-SE

CYFRONET-TMP-SE

ULAKBIM-TMP-SE

KEK-DEV-TMP-SE

SIGNET-TMP-SE

Torino-TMP-SE

MPPMU-TMP-SE

HEPHY-TMP-SE

NTUCC-TMP-SE

BNL-TMP-SE

UVic-TMP-SE-DYNA

Australia-SE

IHEP-TMP-SE

CNAF-TMP-SE

FINISHED

Duration: 15 seconds

FINISHED

Duration: 10 seconds

FINISHED

Duration: 11 seconds

FINISHED

Duration: 24 seconds

FAILED

Reason: TRANSFER [5] TRANSFER ERROR: Copy failed with mode 3rd push, with error: Transfer failure: Error pushing https://basilisk02.westgrid.ca:2880/belledisk/TMP/belle/test/TPC/1G-test-push-CNAF-TMP-SE: 500 status code: 500, reason phrase: Server Error

FINISHED

Duration: 11 seconds

FINISHED

Duration: 738 seconds

FINISHED

Duration: 31 seconds

FINISHED

Duration: 12 seconds

FINISHED

Duration: 11 seconds

FINISHED

Duration: 23 seconds

FINISHED

Duration: 72 seconds

FINISHED

Duration: 49 seconds

FINISHED

Duration: 20 seconds

FINISHED

Duration: 77 seconds

FINISHED

Duration: 23 seconds

FINISHED

Duration: 2039 seconds

FAILED

Reason: TRANSFER [5] TRANSFER ERROR: Copy failed with mode 3rd push, with error: Transfer failure: SSLException while pushing https://eos.grid.vbc.ac.at:8443/eos/vbc/experiments/belle/TMP/belle/test/TPC/1G-test-push-CNAF-TMP-SE: Connection reset by peer (Write failed)

FINISHED

Duration: 109 seconds

FINISHED

Duration: 32 seconds

FAILED

Reason: TRANSFER [5] TRANSFER ERROR: Copy failed with mode 3rd push, with error: Transfer failure: SSLException while pushing https://dynafed02.heprc.uvic.ca:8443/dynafed/TMP/belle/test/TPC/1G-test-push-CNAF-TMP-SE: Broken pipe (Write failed)

FAILED

Reason: TRANSFER [5] TRANSFER ERROR: Copy failed with mode 3rd push, with error: Transfer failure: Error pushing https://dynafed02.heprc.uvic.ca:8443/dynafed/Melbourne/TMP/belle/test/TPC/1G-test-push-CNAF-TMP-SE: 404 status code: 404, reason phrase: Not Found

ACTIVE

Reason:

DESY-TMP-SE

FINISHED

Duration: 25 seconds

FINISHED

Duration: 13 seconds

FINISHED

Duration: 8 seconds

FINISHED

Duration: 21 seconds

FAILED

Reason: TRANSFER [5] TRANSFER ERROR: Copy failed with mode 3rd push, with error: Transfer failure: rejected PUT: 500 No such file or directory: 00006411A92191374DB0A2AD4EEDB9A25899; redirections [http://206.12.48.242:20663/pnfs/westgrid.uvic.ca/data/belle/belledisk/TMP/belle/test/TPC/1G-test-push-DESY-TMP-SE?dcache-http-uuid=f3025fc1-b761-41a0-b624-ef39c61e7bb7]\n

FINISHED

Duration: 11 seconds

FINISHED

Duration: 510 seconds

FINISHED

Duration: 21 seconds

FINISHED

Duration: 15 seconds

FINISHED

Duration: 17 seconds

FINISHED

Duration: 22 seconds

FINISHED

Duration: 78 seconds

FINISHED

Duration: 28 seconds

FINISHED

Duration: 55 seconds

FINISHED

Duration: 18 seconds

FINISHED

Duration: 23 seconds

FINISHED

Duration: 861 seconds

FINISHED

Duration: 16 seconds

FINISHED

Duration: 477 seconds

FINISHED

Duration: 37 seconds

FAILED

Reason: TRANSFER [5] TRANSFER ERROR: Copy failed with mode 3rd push, with error: Transfer failure: rejected PUT: 401 login failed; redirections [https://basilisk02.westgrid.ca:2880/belledisk/TMP/belle/test/TPC/1G-test-push-DESY-TMP-SE]\n

FAILED

Reason: TRANSFER [5] TRANSFER ERROR: Copy failed with mode 3rd push, with error: Transfer failure: rejected PUT: 404 Not Found\n

FINISHED

Duration: 83 seconds

IN2P3CC-TMP-SE

FINISHED

Duration: 16 seconds

FINISHED

Duration: 13 seconds

FINISHED

Duration: 9 seconds

FINISHED

Duration: 16 seconds

FAILED

Reason: TRANSFER [5] TRANSFER ERROR: Copy failed with mode 3rd push, with error: Transfer failure: rejected PUT: 500 No such file or directory: 00008D93964A1D1C48D1A96A53A4184D6553; redirections [http://206.12.48.245:22943/pnfs/westgrid.uvic.ca/data/belle/belledisk/TMP/belle/test/TPC/1G-test-push-IN2P3CC-TMP-SE?dcache-http-uuid=e1e8d110-bf7b-4192-a1d6-5e6ec7fb6aac]\n

FINISHED

Duration: 7 seconds

FINISHED

Duration: 257 seconds

FINISHED

Duration: 8 seconds

FINISHED

Duration: 12 seconds

FINISHED

Duration: 10 seconds

FINISHED

Duration: 12 seconds

FINISHED

Duration: 57 seconds

FINISHED

Duration: 24 seconds

FINISHED

Duration: 57 seconds

FINISHED

Duration: 15 seconds

FINISHED

Duration: 20 seconds

FINISHED

Duration: 845 seconds

FINISHED

Duration: 17 seconds

FINISHED

Duration: 705 seconds

FINISHED

Duration: 33 seconds

FAILED

Reason: TRANSFER [5] TRANSFER ERROR: Copy failed with mode 3rd push, with error: Transfer failure: rejected PUT: 401 login failed; redirections [https://basilisk02.westgrid.ca:2880/belledisk/TMP/belle/test/TPC/1G-test-push-IN2P3CC-TMP-SE]\n

FAILED

Reason: TRANSFER [5] TRANSFER ERROR: Copy failed with mode 3rd push, with error: Transfer failure: rejected PUT: 404 Not Found\n

FAILED

Reason: TRANSFER [5] TRANSFER ERROR: Copy failed with mode 3rd push, with error: Transfer failure: rejected PUT: 403 Forbidden; redirections [https://dpmbelle01.ihep.ac.cn:443/storage/belle01_02/belle/2022-07-06/1G-test-push-IN2P3CC-TMP-SE.1848835.1657084954?sfn=%2Fdpm%2Fihep.ac.cn%2Fhome%2Fbelle%2FTMP%2Fbelle%2Ftest%2FTPC%2F1G-test-push-IN2P3CC-TMP-SE&token=VT0S96h9Lkkhz1dWZeabeReOSSA%3D%401657085954%401]\n

KIT-TMP-SE

FINISHED

Duration: 22 seconds

FINISHED

Duration: 11 seconds

FINISHED

Duration: 7 seconds

FINISHED

Duration: 27 seconds

FAILED

Reason: TRANSFER [5] TRANSFER ERROR: Copy failed with mode 3rd push, with error: Transfer failure: rejected PUT: 500 No such file or directory: 00003932893C8C9A43C59884EFCAD6407961; redirections [http://206.12.48.242:21958/pnfs/westgrid.uvic.ca/data/belle/belledisk/TMP/belle/test/TPC/1G-test-push-KIT-TMP-SE?dcache-http-uuid=97ea42af-1fb2-4f80-b1c9-d7ce5ccc537d]\n

FINISHED

Duration: 5 seconds

FINISHED

Duration: 443 seconds

FINISHED

Duration: 11 seconds

FINISHED

Duration: 13 seconds

FINISHED

Duration: 13 seconds

FINISHED

Duration: 15 seconds

FINISHED

Duration: 53 seconds

FINISHED

Duration: 22 seconds

FINISHED

Duration: 71 seconds

FINISHED

Duration: 17 seconds

FINISHED

Duration: 28 seconds

FINISHED

Duration: 687 seconds

FINISHED

Duration: 28 seconds

FINISHED

Duration: 482 seconds

FINISHED

Duration: 33 seconds

FAILED

Reason: TRANSFER [5] TRANSFER ERROR: Copy failed with mode 3rd push, with error: Transfer failure: rejected PUT: 401 login failed; redirections [https://basilisk02.westgrid.ca:2880/belledisk/TMP/belle/test/TPC/1G-test-push-KIT-TMP-SE]\n

FAILED

Reason: TRANSFER [5] TRANSFER ERROR: Copy failed with mode 3rd push, with error: Transfer failure: rejected PUT: 404 Not Found\n

FAILED

Reason: TRANSFER [5] TRANSFER ERROR: Copy failed with mode 3rd push, with error: Transfer failure: rejected PUT: 403 Forbidden; redirections [https://dpmbelle01.ihep.ac.cn:443/storage/belle01_03/belle/2022-07-06/1G-test-push-KIT-TMP-SE.1848871.1657085062?sfn=%2Fdpm%2Fihep.ac.cn%2Fhome%2Fbelle%2FTMP%2Fbelle%2Ftest%2FTPC%2F1G-test-push-KIT-TMP-SE&token=l%2BcKyYGSstsRaHHbHXfqSulzf9E%3D%401657086062%401]\n

Napoli-TMP-SE

FINISHED

Duration: 27 seconds

FINISHED

Duration: 20 seconds

FINISHED

Duration: 26 seconds

FINISHED

Duration: 27 seconds

FINISHED

Duration: 127 seconds

FINISHED

Duration: 17 seconds

FINISHED

Duration: 394 seconds

FINISHED

Duration: 176 seconds

FINISHED

Duration: 13 seconds

FINISHED

Duration: 6 seconds

FINISHED

Duration: 15 seconds

FINISHED

Duration: 37 seconds

FINISHED

Duration: 39 seconds

FINISHED

Duration: 81 seconds

FINISHED

Duration: 16 seconds

FINISHED

Duration: 25 seconds

ACTIVE

Reason:

FINISHED

Duration: 36 seconds

FINISHED

Duration: 399 seconds

FINISHED

Duration: 60 seconds

FAILED

Reason: TRANSFER [5] TRANSFER ERROR: Copy failed with mode 3rd push, with error: Transfer failure: Remote copy failed with status code 401: \n

FAILED

Reason: TRANSFER [5] TRANSFER ERROR: Copy failed with mode 3rd push, with error: Transfer failure: Remote copy failed with status code 404: \n

FAILED

Reason: TRANSFER [5] TRANSFER ERROR: Copy failed with mode 3rd push, with error: Transfer failure: Remote copy failed with status code 403: \n

UVic-TMP-SE1

FINISHED

Duration: 18 seconds

FINISHED

Duration: 23 seconds

FINISHED

Duration: 22 seconds

FINISHED

Duration: 22 seconds

FINISHED

Duration: 25 seconds

FINISHED

Duration: 8 seconds

FINISHED

Duration: 223 seconds

FINISHED

Duration: 201 seconds

FINISHED

Duration: 7 seconds

FINISHED

Duration: 19 seconds

FINISHED

Duration: 25 seconds

FINISHED

Duration: 54 seconds

FINISHED

Duration: 29 seconds

FINISHED

Duration: 12 seconds

FINISHED

Duration: 41 seconds

FINISHED

Duration: 22 seconds

FINISHED

Duration: 92 seconds

FINISHED

Duration: 29 seconds

FAILED

Reason: TRANSFER [5] TRANSFER ERROR: Copy failed with mode 3rd push, with error: Transfer failure: problem sending data: Certificate for doesn't match any of the subject alternative names: [john@hep1.phys.ntu.edu.tw]\n

FINISHED

Duration: 9 seconds

FAILED

Reason: TRANSFER [5] TRANSFER ERROR: Copy failed with mode 3rd push, with error: Transfer failure: rejected PUT: 401 login failed; redirections [https://basilisk02.westgrid.ca:2880/belledisk/TMP/belle/test/TPC/1G-test-push-UVic-TMP-SE1]\n

FAILED

Reason: TRANSFER [5] TRANSFER ERROR: Copy failed with mode 3rd push, with error: Transfer failure: rejected PUT: 404 Not Found\n

FINISHED

Duration: 33 seconds

CESNET-TMP-SE

FINISHED

Duration: 27 seconds

FINISHED

Duration: 11 seconds

FINISHED

Duration: 7 seconds

FINISHED

Duration: 6 seconds

FINISHED

Duration: 20 seconds

FAILED

Reason: TRANSFER [5] TRANSFER ERROR: Copy failed with mode 3rd push, with error: Transfer failure: rejected PUT: 500 No such file or directory: 0000B19FC14D02D8459C922C6B426FE439DC; redirections [http://206.12.48.242:21730/pnfs/westgrid.uvic.ca/data/belle/belledisk/TMP/belle/test/TPC/1G-test-push-CESNET-TMP-SE?dcache-http-uuid=ca6021f2-7aa0-4431-aff3-8c53d099405c]\n

FINISHED

Duration: 335 seconds

FINISHED

Duration: 16 seconds

FINISHED

Duration: 13 seconds

FINISHED

Duration: 11 seconds

FINISHED

Duration: 18 seconds

FINISHED

Duration: 37 seconds

FINISHED

Duration: 25 seconds

FINISHED

Duration: 10 seconds

FINISHED

Duration: 10 seconds

FINISHED

Duration: 22 seconds

FINISHED

Duration: 107 seconds

FINISHED

Duration: 9 seconds

FINISHED

Duration: 42 seconds

FINISHED

Duration: 39 seconds

FAILED

Reason: TRANSFER [5] TRANSFER ERROR: Copy failed with mode 3rd push, with error: Transfer failure: rejected PUT: 401 login failed; redirections [https://basilisk02.westgrid.ca:2880/belledisk/TMP/belle/test/TPC/1G-test-push-CESNET-TMP-SE]\n

FAILED

Reason: TRANSFER [5] TRANSFER ERROR: Copy failed with mode 3rd push, with error: Transfer failure: rejected PUT: 404 Not Found\n

ACTIVE

Reason:

IPHC-TMP-SE

FINISHED

Duration: 66 seconds

FINISHED

Duration: 19 seconds

FINISHED

Duration: 6 seconds

FINISHED

Duration: 15 seconds

FINISHED

Duration: 25 seconds

FAILED

Reason: TRANSFER [5] TRANSFER ERROR: Copy failed with mode 3rd push, with error: Transfer failure: Remote copy failed with status code 500: Temporary Redirect\n

FINISHED

Duration: 12 seconds

FINISHED

Duration: 84 seconds

FINISHED

Duration: 13 seconds

FINISHED

Duration: 13 seconds

FINISHED

Duration: 15 seconds

FINISHED

Duration: 57 seconds

FINISHED

Duration: 30 seconds

FINISHED

Duration: 78 seconds

FINISHED

Duration: 15 seconds

FINISHED

Duration: 21 seconds

FINISHED

Duration: 1199 seconds

FINISHED

Duration: 21 seconds

FINISHED

Duration: 507 seconds

FINISHED

Duration: 51 seconds

FAILED

Reason: TRANSFER [5] TRANSFER ERROR: Copy failed with mode 3rd push, with error: Transfer failure: Remote copy failed with status code 401: \n

FAILED

Reason: TRANSFER [5] TRANSFER ERROR: Copy failed with mode 3rd push, with error: Transfer failure: Remote copy failed with status code 404: \n

FAILED

Reason: TRANSFER [5] TRANSFER ERROR: Copy failed with mode 3rd push, with error: Transfer failure: Remote copy failed with status code 403: \n

LAL-TMP-SE

FINISHED

Duration: 18 seconds

FINISHED

Duration: 17 seconds

FINISHED

Duration: 5 seconds

FINISHED

Duration: 12 seconds

FINISHED

Duration: 35 seconds

FAILED

Reason: TRANSFER [5] TRANSFER ERROR: Copy failed with mode 3rd push, with error: Transfer failure: Remote copy failed with status code 500: Temporary Redirect\n

FINISHED

Duration: 12 seconds

FINISHED

Duration: 151 seconds

FINISHED

Duration: 15 seconds

FINISHED

Duration: 14 seconds

FINISHED

Duration: 14 seconds

FINISHED

Duration: 57 seconds

FINISHED

Duration: 33 seconds

FINISHED

Duration: 75 seconds

FINISHED

Duration: 13 seconds

FINISHED

Duration: 25 seconds

FINISHED

Duration: 1175 seconds

FINISHED

Duration: 18 seconds

FINISHED

Duration: 445 seconds

FINISHED

Duration: 45 seconds

FAILED

Reason: TRANSFER [5] TRANSFER ERROR: Copy failed with mode 3rd push, with error: Transfer failure: Remote copy failed with status code 401: \n

FAILED

Reason: TRANSFER [5] TRANSFER ERROR: Copy failed with mode 3rd push, with error: Transfer failure: Remote copy failed with status code 404: \n

FAILED

Reason: TRANSFER [5] TRANSFER ERROR: Copy failed with mode 3rd push, with error: Transfer failure: Remote copy failed with status code 403: \n

Pisa-TMP-SE

FINISHED

Duration: 15 seconds

FINISHED

Duration: 15 seconds

FINISHED

Duration: 8 seconds

FINISHED

Duration: 12 seconds

FINISHED

Duration: 14 seconds

FAILED

Reason: TRANSFER [5] TRANSFER ERROR: Copy failed with mode 3rd push, with error: Transfer failure: Error pushing https://basilisk02.westgrid.ca:2880/belledisk/TMP/belle/test/TPC/1G-test-push-Pisa-TMP-SE: 500 status code: 500, reason phrase: Server Error

ACTIVE

Reason:

FINISHED

Duration: 50 seconds

FINISHED

Duration: 21 seconds

FINISHED

Duration: 7 seconds

FINISHED

Duration: 14 seconds

FINISHED

Duration: 55 seconds

FINISHED

Duration: 49 seconds

FINISHED

Duration: 11 seconds

FINISHED

Duration: 80 seconds

FINISHED

Duration: 23 seconds

FINISHED

Duration: 29 seconds

FAILED

Reason: TRANSFER [5] TRANSFER ERROR: Copy failed with mode 3rd push, with error: Transfer failure: SocketException while pushing https://eos.grid.vbc.ac.at:8443/eos/vbc/experiments/belle/TMP/belle/test/TPC/1G-test-push-Pisa-TMP-SE: Connection reset by peer (Write failed)

FINISHED

Duration: 456 seconds

FAILED

Reason: TRANSFER [5] TRANSFER ERROR: Copy failed with mode 3rd push, with error: Transfer failure: SocketTimeoutException while pushing https://dcbldoor.sdcc.bnl.gov:443/pnfs/sdcc.bnl.gov/data/bellediskdata/TMP/belle/test/TPC/1G-test-push-Pisa-TMP-SE: Read timed out

FAILED

Reason: TRANSFER [5] TRANSFER ERROR: Copy failed with mode 3rd push, with error: Transfer failure: SocketException while pushing https://dynafed02.heprc.uvic.ca:8443/dynafed/TMP/belle/test/TPC/1G-test-push-Pisa-TMP-SE: Broken pipe (Write failed)

FAILED

Reason: TRANSFER [5] TRANSFER ERROR: Copy failed with mode 3rd push, with error: Transfer failure: Error pushing https://dynafed02.heprc.uvic.ca:8443/dynafed/Melbourne/TMP/belle/test/TPC/1G-test-push-Pisa-TMP-SE: 404 status code: 404, reason phrase: Not Found

FINISHED

Duration: 103 seconds

ROMA3-TMP-SE

FINISHED

Duration: 27 seconds

FINISHED

Duration: 18 seconds

FINISHED

Duration: 16 seconds

FINISHED

Duration: 35 seconds

FINISHED

Duration: 38 seconds

FAILED

Reason: TRANSFER [5] TRANSFER ERROR: Copy failed with mode 3rd push, with error: Transfer failure: Error pushing https://basilisk02.westgrid.ca:2880/belledisk/TMP/belle/test/TPC/1G-test-push-ROMA3-TMP-SE: 500 status code: 500, reason phrase: Server Error

FINISHED

Duration: 15 seconds

FINISHED

Duration: 865 seconds

FINISHED

Duration: 48 seconds

FINISHED

Duration: 32 seconds

FINISHED

Duration: 32 seconds

FINISHED

Duration: 67 seconds

FINISHED

Duration: 55 seconds

FINISHED

Duration: 41 seconds

FINISHED

Duration: 78 seconds

FINISHED

Duration: 36 seconds

FINISHED

Duration: 1843 seconds

FAILED

Reason: TRANSFER [5] TRANSFER ERROR: Copy failed with mode 3rd push, with error: Transfer failure: SSLException while pushing https://eos.grid.vbc.ac.at:8443/eos/vbc/experiments/belle/TMP/belle/test/TPC/1G-test-push-ROMA3-TMP-SE: Write error: ssl=0x7f8ad014fe48: I/O error during system call, Connection reset by peer

FINISHED

Duration: 182 seconds

FINISHED

Duration: 54 seconds

FAILED

Reason: TRANSFER [5] TRANSFER ERROR: Copy failed with mode 3rd push, with error: Transfer failure: SSLException while pushing https://dynafed02.heprc.uvic.ca:8443/dynafed/TMP/belle/test/TPC/1G-test-push-ROMA3-TMP-SE: Write error: ssl=0x7f8ddc175838: I/O error during system call, Broken pipe

FAILED

Reason: TRANSFER [5] TRANSFER ERROR: Copy failed with mode 3rd push, with error: Transfer failure: Error pushing https://dynafed02.heprc.uvic.ca:8443/dynafed/Melbourne/TMP/belle/test/TPC/1G-test-push-ROMA3-TMP-SE: 404 status code: 404, reason phrase: Not Found

ACTIVE

Reason:

Frascati-TMP-SE

FINISHED

Duration: 14 seconds

FINISHED

Duration: 20 seconds

FINISHED

Duration: 10 seconds

FINISHED

Duration: 17 seconds

FINISHED

Duration: 7 seconds

FAILED

Reason: TRANSFER [5] TRANSFER ERROR: Copy failed with mode 3rd push, with error: Transfer failure: Remote copy failed with status code 500: Temporary Redirect\n

FINISHED

Duration: 15 seconds

FINISHED

Duration: 473 seconds

FINISHED

Duration: 14 seconds

FINISHED

Duration: 7 seconds

FINISHED

Duration: 7 seconds

FINISHED

Duration: 87 seconds

FINISHED

Duration: 32 seconds

FINISHED

Duration: 88 seconds

FINISHED

Duration: 18 seconds

FINISHED

Duration: 23 seconds

FINISHED

Duration: 1755 seconds

FINISHED

Duration: 19 seconds

FINISHED

Duration: 146 seconds

FINISHED

Duration: 49 seconds

FAILED

Reason: TRANSFER [5] TRANSFER ERROR: Copy failed with mode 3rd push, with error: Transfer failure: Remote copy failed with status code 401: \n

FAILED

Reason: TRANSFER [5] TRANSFER ERROR: Copy failed with mode 3rd push, with error: Transfer failure: Remote copy failed with status code 404: \n

FAILED

Reason: TRANSFER [5] TRANSFER ERROR: Copy failed with mode 3rd push, with error: Transfer failure: Remote copy failed with status code 403: \n

CYFRONET-TMP-SE

FINISHED

Duration: 80 seconds

FINISHED

Duration: 22 seconds

FINISHED

Duration: 40 seconds

FINISHED

Duration: 41 seconds

FINISHED

Duration: 65 seconds

FAILED

Reason: TRANSFER [5] TRANSFER ERROR: Copy failed with mode 3rd push, with error: Transfer failure: Remote copy failed with status code 500: Temporary Redirect\n

FINISHED

Duration: 12 seconds

FINISHED

Duration: 460 seconds

FINISHED

Duration: 105 seconds

FINISHED

Duration: 65 seconds

FINISHED

Duration: 52 seconds

FINISHED

Duration: 65 seconds

FINISHED

Duration: 64 seconds

FINISHED

Duration: 89 seconds

FINISHED

Duration: 58 seconds

FINISHED

Duration: 63 seconds

FINISHED

Duration: 1462 seconds

FINISHED

Duration: 53 seconds

FINISHED

Duration: 215 seconds

FINISHED

Duration: 73 seconds

FAILED

Reason: TRANSFER [5] TRANSFER ERROR: Copy failed with mode 3rd push, with error: Transfer failure: Remote copy failed with status code 401: \n

FAILED

Reason: TRANSFER [5] TRANSFER ERROR: Copy failed with mode 3rd push, with error: Transfer failure: Remote copy failed with status code 404: \n

FAILED

Reason: TRANSFER [5] TRANSFER ERROR: Copy failed with mode 3rd push, with error: Transfer failure: Remote copy failed with status code 403: \n

ULAKBIM-TMP-SE

FINISHED

Duration: 47 seconds

FINISHED

Duration: 27 seconds

FINISHED

Duration: 24 seconds

FINISHED

Duration: 23 seconds

FINISHED

Duration: 32 seconds

FAILED

Reason: TRANSFER [5] TRANSFER ERROR: Copy failed with mode 3rd push, with error: Transfer failure: Remote copy failed with status code 500: \n

FINISHED

Duration: 21 seconds

FINISHED

Duration: 438 seconds

FINISHED

Duration: 28 seconds

FINISHED

Duration: 30 seconds

FINISHED

Duration: 27 seconds

FINISHED

Duration: 33 seconds

FINISHED

Duration: 52 seconds

FINISHED

Duration: 95 seconds

FINISHED

Duration: 20 seconds

FINISHED

Duration: 30 seconds

ACTIVE

Reason:

FINISHED

Duration: 25 seconds

FINISHED

Duration: 145 seconds

FINISHED

Duration: 59 seconds

FAILED

Reason: TRANSFER [5] TRANSFER ERROR: Copy failed with mode 3rd push, with error: Transfer failure: Remote copy failed with status code 401: \n

FAILED

Reason: TRANSFER [5] TRANSFER ERROR: Copy failed with mode 3rd push, with error: Transfer failure: Remote copy failed with status code 404: \n

FAILED

Reason: TRANSFER [5] TRANSFER ERROR: Copy failed with mode 3rd push, with error: Transfer failure: Remote copy failed with status code 403: \n

KEK-DEV-TMP-SE

FINISHED

Duration: 29 seconds

FINISHED

Duration: 63 seconds

FINISHED

Duration: 63 seconds

FINISHED

Duration: 63 seconds

FINISHED

Duration: 109 seconds

FINISHED

Duration: 34 seconds

FINISHED

Duration: 66 seconds

FINISHED

Duration: 798 seconds

FINISHED

Duration: 498 seconds

FINISHED

Duration: 25 seconds

FINISHED

Duration: 57 seconds

FINISHED

Duration: 137 seconds

FINISHED

Duration: 138 seconds

FINISHED

Duration: 149 seconds

FINISHED

Duration: 79 seconds

FINISHED

Duration: 67 seconds

ACTIVE

Reason:

FAILED

Reason: TRANSFER [5] TRANSFER ERROR: Copy failed with mode 3rd push, with error: Transfer failure: SSLException while pushing https://eos.grid.vbc.ac.at:8443/eos/vbc/experiments/belle/TMP/belle/test/TPC/1G-test-push-KEK-DEV-TMP-SE: Write error: ssl=0x7fc830025108: I/O error during system call, Connection reset by peer

FINISHED

Duration: 214 seconds

FINISHED

Duration: 61 seconds

FAILED

Reason: TRANSFER [5] TRANSFER ERROR: Copy failed with mode 3rd push, with error: Transfer failure: SSLException while pushing https://dynafed02.heprc.uvic.ca:8443/dynafed/TMP/belle/test/TPC/1G-test-push-KEK-DEV-TMP-SE: Write error: ssl=0x7fa7d06bece8: I/O error during system call, Broken pipe

FAILED

Reason: TRANSFER [5] TRANSFER ERROR: Copy failed with mode 3rd push, with error: Transfer failure: Error pushing https://dynafed02.heprc.uvic.ca:8443/dynafed/Melbourne/TMP/belle/test/TPC/1G-test-push-KEK-DEV-TMP-SE: 404 status code: 404, reason phrase: Not Found

FINISHED

Duration: 74 seconds

SIGNET-TMP-SE

FINISHED

Duration: 44 seconds

FINISHED

Duration: 37 seconds

FINISHED

Duration: 897 seconds

FINISHED

Duration: 51 seconds

FINISHED

Duration: 43 seconds

FAILED

Reason: TRANSFER [5] TRANSFER ERROR: Copy failed with mode 3rd push, with error: Transfer failure: rejected PUT: 500 No such file or directory: 0000C05EA156C2DD4588B2B30FC041F00415; redirections [http://206.12.48.242:20663/pnfs/westgrid.uvic.ca/data/belle/belledisk/TMP/belle/test/TPC/1G-test-push-SIGNET-TMP-SE?dcache-http-uuid=bb8bd5a8-2d34-4b19-bc6a-7214976ef1db]\n

FINISHED

Duration: 25 seconds

FINISHED

Duration: 153 seconds

FINISHED

Duration: 46 seconds

FINISHED

Duration: 33 seconds

FINISHED

Duration: 31 seconds

FINISHED

Duration: 30 seconds

FINISHED

Duration: 304 seconds

FINISHED

Duration: 66 seconds

FINISHED

Duration: 273 seconds

FINISHED

Duration: 33 seconds

ACTIVE

Reason:

FINISHED

Duration: 35 seconds

FINISHED

Duration: 397 seconds

FINISHED

Duration: 1290 seconds

FAILED

Reason: TRANSFER [5] TRANSFER ERROR: Copy failed with mode 3rd push, with error: Transfer failure: rejected PUT: 401 login failed; redirections [https://basilisk02.westgrid.ca:2880/belledisk/TMP/belle/test/TPC/1G-test-push-SIGNET-TMP-SE]\n

FAILED

Reason: TRANSFER [5] TRANSFER ERROR: Copy failed with mode 3rd push, with error: Transfer failure: rejected PUT: 404 Not Found\n

FAILED

Reason: TRANSFER [5] TRANSFER ERROR: Copy failed with mode 3rd push, with error: Transfer failure: rejected PUT: 403 Forbidden; redirections [https://dpmbelle01.ihep.ac.cn:443/storage/belle01_03/belle/2022-07-06/1G-test-push-SIGNET-TMP-SE.1848948.1657085297?sfn=%2Fdpm%2Fihep.ac.cn%2Fhome%2Fbelle%2FTMP%2Fbelle%2Ftest%2FTPC%2F1G-test-push-SIGNET-TMP-SE&token=i5Ha2d52%2BQwip4XtTpCG7ZxIUNA%3D%401657086297%401]\n

Torino-TMP-SE

FINISHED

Duration: 15 seconds

FINISHED

Duration: 19 seconds

FINISHED

Duration: 8 seconds

FINISHED

Duration: 13 seconds

FINISHED

Duration: 12 seconds

FINISHED

Duration: 56 seconds

FINISHED

Duration: 12 seconds

FINISHED

Duration: 750 seconds

FINISHED

Duration: 20 seconds

FINISHED

Duration: 12 seconds

FINISHED

Duration: 8 seconds

FINISHED

Duration: 10 seconds

FINISHED

Duration: 60 seconds

FINISHED

Duration: 51 seconds

FINISHED

Duration: 73 seconds

FINISHED

Duration: 78 seconds

FINISHED

Duration: 161 seconds

FAILED

Reason: TRANSFER [5] TRANSFER ERROR: Copy failed with mode 3rd push, with error: Transfer failure: SocketException while pushing https://eos.grid.vbc.ac.at:8443/eos/vbc/experiments/belle/TMP/belle/test/TPC/1G-test-push-Torino-TMP-SE: Connection reset by peer (Write failed)

FINISHED

Duration: 151 seconds

FINISHED

Duration: 37 seconds

FAILED

Reason: TRANSFER [5] TRANSFER ERROR: Copy failed with mode 3rd push, with error: Transfer failure: SocketException while pushing https://dynafed02.heprc.uvic.ca:8443/dynafed/TMP/belle/test/TPC/1G-test-push-Torino-TMP-SE: Broken pipe (Write failed)

FAILED

Reason: TRANSFER [5] TRANSFER ERROR: Copy failed with mode 3rd push, with error: Transfer failure: Error pushing https://dynafed02.heprc.uvic.ca:8443/dynafed/Melbourne/TMP/belle/test/TPC/1G-test-push-Torino-TMP-SE: 404 status code: 404, reason phrase: Not Found

ACTIVE

Reason:

MPPMU-TMP-SE

FINISHED

Duration: 19 seconds

FINISHED

Duration: 15 seconds

FINISHED

Duration: 31 seconds

FINISHED

Duration: 13 seconds

FINISHED

Duration: 36 seconds

FINISHED

Duration: 119 seconds

FINISHED

Duration: 9 seconds

FINISHED

Duration: 431 seconds

FINISHED

Duration: 26 seconds

FINISHED

Duration: 19 seconds

FINISHED

Duration: 28 seconds

FINISHED

Duration: 30 seconds

FINISHED

Duration: 51 seconds

FINISHED

Duration: 38 seconds

FINISHED

Duration: 55 seconds

FINISHED

Duration: 24 seconds

FINISHED

Duration: 25 seconds

FINISHED

Duration: 29 seconds

FINISHED

Duration: 768 seconds

FINISHED

Duration: 37 seconds

FAILED

Reason: TRANSFER [5] TRANSFER ERROR: Copy failed with mode 3rd push, with error: Transfer failure: rejected PUT: 401 login failed; redirections [https://basilisk02.westgrid.ca:2880/belledisk/TMP/belle/test/TPC/1G-test-push-MPPMU-TMP-SE]\n

FAILED

Reason: TRANSFER [5] TRANSFER ERROR: Copy failed with mode 3rd push, with error: Transfer failure: rejected PUT: 404 Not Found\n

FAILED

Reason: TRANSFER [5] TRANSFER ERROR: Copy failed with mode 3rd push, with error: Transfer failure: rejected PUT: 403 Forbidden; redirections [https://dpmbelle01.ihep.ac.cn:443/storage/belle01_01/belle/2022-07-06/1G-test-push-MPPMU-TMP-SE.1848899.1657085130?sfn=%2Fdpm%2Fihep.ac.cn%2Fhome%2Fbelle%2FTMP%2Fbelle%2Ftest%2FTPC%2F1G-test-push-MPPMU-TMP-SE&token=95EoKNiXMD6UmrP8g2RSpj5AWKc%3D%401657086130%401]\n

HEPHY-TMP-SE

FINISHED

Duration: 67 seconds

FINISHED

Duration: 19 seconds

FINISHED

Duration: 16 seconds

FINISHED

Duration: 22 seconds

FINISHED

Duration: 17 seconds

FAILED

Reason: TRANSFER [5] TRANSFER ERROR: Copy failed with mode 3rd push, with error: Transfer failure: Remote side failed with status code 500

FINISHED

Duration: 21 seconds

FINISHED

Duration: 450 seconds

FINISHED

Duration: 18 seconds

FINISHED

Duration: 18 seconds

FINISHED

Duration: 16 seconds

FINISHED

Duration: 16 seconds

FINISHED

Duration: 29 seconds

FINISHED

Duration: 19 seconds

FINISHED

Duration: 79 seconds

FINISHED

Duration: 15 seconds

FINISHED

Duration: 24 seconds

FINISHED

Duration: 933 seconds

FINISHED

Duration: 279 seconds

FAILED

Reason: TRANSFER [5] TRANSFER ERROR: Copy failed with mode 3rd push, with error: Transfer failure: Remote side failed with status code 500

FAILED

Reason: TRANSFER [5] TRANSFER ERROR: Copy failed with mode 3rd push, with error: Transfer failure: Remote side failed with status code 401

FAILED

Reason: TRANSFER [5] TRANSFER ERROR: Copy failed with mode 3rd push, with error: Transfer failure: Remote side failed with status code 404

ACTIVE

Reason:

NTUCC-TMP-SE

FINISHED

Duration: 147 seconds

FINISHED

Duration: 202 seconds

FINISHED

Duration: 201 seconds

FINISHED

Duration: 221 seconds

FINISHED

Duration: 199 seconds

FAILED

Reason: TRANSFER [5] TRANSFER ERROR: Copy failed with mode 3rd push, with error: Transfer failure: rejected PUT: 500 No such file or directory: 000096E5FBB4835948D088295250A2111D03; redirections [http://206.12.48.245:20840/pnfs/westgrid.uvic.ca/data/belle/belledisk/TMP/belle/test/TPC/1G-test-push-NTUCC-TMP-SE?dcache-http-uuid=e9a1955a-e4d4-4188-8cd0-d2ec508d3941]\n

FINISHED

Duration: 171 seconds

FINISHED

Duration: 619 seconds

FINISHED

Duration: 1086 seconds

FINISHED

Duration: 141 seconds

FINISHED

Duration: 182 seconds

FINISHED

Duration: 209 seconds

FINISHED

Duration: 199 seconds

FINISHED

Duration: 183 seconds

FINISHED

Duration: 84 seconds

FINISHED

Duration: 200 seconds

FINISHED

Duration: 193 seconds

FINISHED

Duration: 378 seconds

FINISHED

Duration: 172 seconds

FINISHED

Duration: 212 seconds

FAILED

Reason: TRANSFER [5] TRANSFER ERROR: Copy failed with mode 3rd push, with error: Transfer failure: rejected PUT: 401 login failed; redirections [https://basilisk02.westgrid.ca:2880/belledisk/TMP/belle/test/TPC/1G-test-push-NTUCC-TMP-SE]\n

FAILED

Reason: TRANSFER [5] TRANSFER ERROR: Copy failed with mode 3rd push, with error: Transfer failure: rejected PUT: 404 Not Found\n

FINISHED

Duration: 97 seconds

BNL-TMP-SE

FAILED

Reason: TRANSFER [5] TRANSFER ERROR: Copy failed with mode 3rd push, with error: Transfer failure: Failed to select pool: Request to [>PoolManager@dCacheDomain] timed out.\n

FAILED

Reason: TRANSFER [5] TRANSFER ERROR: Copy failed with mode 3rd push, with error: Transfer failure: Failed to select pool: Request to [>PoolManager@dCacheDomain] timed out.\n

FAILED

Reason: TRANSFER [5] TRANSFER ERROR: Copy failed with mode 3rd push, with error: Transfer failure: Failed to select pool: Request to [>PoolManager@dCacheDomain] timed out.\n

FAILED

Reason: TRANSFER [5] TRANSFER ERROR: Copy failed with mode 3rd push, with error: Transfer failure: Failed to select pool: Request to [>PoolManager@dCacheDomain] timed out.\n

FAILED

Reason: TRANSFER [5] TRANSFER ERROR: Copy failed with mode 3rd push, with error: Transfer failure: Failed to select pool: Request to [>PoolManager@dCacheDomain] timed out.\n

FAILED

Reason: TRANSFER [5] TRANSFER ERROR: Copy failed with mode 3rd push, with error: Transfer failure: Failed to select pool: Request to [>PoolManager@dCacheDomain] timed out.\n

FAILED

Reason: TRANSFER [5] TRANSFER ERROR: Copy failed with mode 3rd push, with error: Transfer failure: Failed to select pool: Request to [>PoolManager@dCacheDomain] timed out.\n

FAILED

Reason: TRANSFER [5] TRANSFER ERROR: Copy failed with mode 3rd push, with error: Transfer failure: Failed to select pool: Request to [>PoolManager@dCacheDomain] timed out.\n

FAILED

Reason: TRANSFER [5] TRANSFER ERROR: Copy failed with mode 3rd push, with error: Transfer failure: Failed to select pool: Request to [>PoolManager@dCacheDomain] timed out.\n

FAILED

Reason: TRANSFER [5] TRANSFER ERROR: Copy failed with mode 3rd push, with error: Transfer failure: Failed to select pool: Request to [>PoolManager@dCacheDomain] timed out.\n

FAILED

Reason: TRANSFER [5] TRANSFER ERROR: Copy failed with mode 3rd push, with error: Transfer failure: Failed to select pool: Request to [>PoolManager@dCacheDomain] timed out.\n

FAILED

Reason: TRANSFER [5] TRANSFER ERROR: Copy failed with mode 3rd push, with error: Transfer failure: Failed to select pool: Request to [>PoolManager@dCacheDomain] timed out.\n

FAILED

Reason: TRANSFER [5] TRANSFER ERROR: Copy failed with mode 3rd push, with error: Transfer failure: Failed to select pool: Request to [>PoolManager@dCacheDomain] timed out.\n

FAILED

Reason: TRANSFER [5] TRANSFER ERROR: Copy failed with mode 3rd push, with error: Transfer failure: Failed to select pool: Request to [>PoolManager@dCacheDomain] timed out.\n

FAILED

Reason: TRANSFER [5] TRANSFER ERROR: Copy failed with mode 3rd push, with error: Transfer failure: Failed to select pool: Request to [>PoolManager@dCacheDomain] timed out.\n

FAILED

Reason: TRANSFER [5] TRANSFER ERROR: Copy failed with mode 3rd push, with error: Transfer failure: Failed to select pool: Request to [>PoolManager@dCacheDomain] timed out.\n

FAILED

Reason: TRANSFER [5] TRANSFER ERROR: Copy failed with mode 3rd push, with error: Transfer failure: Failed to select pool: Request to [>PoolManager@dCacheDomain] timed out.\n

FAILED

Reason: TRANSFER [5] TRANSFER ERROR: Copy failed with mode 3rd push, with error: Transfer failure: Failed to select pool: Request to [>PoolManager@dCacheDomain] timed out.\n

FAILED

Reason: TRANSFER [5] TRANSFER ERROR: Copy failed with mode 3rd push, with error: Transfer failure: Failed to select pool: Request to [>PoolManager@dCacheDomain] timed out.\n

FAILED

Reason: TRANSFER [5] TRANSFER ERROR: Copy failed with mode 3rd push, with error: Transfer failure: Failed to select pool: Request to [>PoolManager@dCacheDomain] timed out.\n

FAILED

Reason: TRANSFER [5] TRANSFER ERROR: Copy failed with mode 3rd push, with error: Transfer failure: Failed to select pool: Request to [>PoolManager@dCacheDomain] timed out.\n

FAILED

Reason: TRANSFER [5] TRANSFER ERROR: Copy failed with mode 3rd push, with error: Transfer failure: Failed to select pool: Request to [>PoolManager@dCacheDomain] timed out.\n

FAILED

Reason: TRANSFER [5] TRANSFER ERROR: Copy failed with mode 3rd push, with error: Transfer failure: Failed to select pool: Request to [>PoolManager@dCacheDomain] timed out.\n

UVic-TMP-SE-DYNA

FINISHED

Duration: 82 seconds

FINISHED

Duration: 25 seconds

FINISHED

Duration: 45 seconds

FINISHED

Duration: 38 seconds

FINISHED

Duration: 123 seconds

FINISHED

Duration: 90 seconds

FINISHED

Duration: 21 seconds

FINISHED

Duration: 468 seconds

FINISHED

Duration: 61 seconds

FINISHED

Duration: 85 seconds

FINISHED

Duration: 68 seconds

FINISHED

Duration: 27 seconds

FINISHED

Duration: 30 seconds

FINISHED

Duration: 42 seconds

FINISHED

Duration: 36 seconds

FINISHED

Duration: 93 seconds

FINISHED

Duration: 51 seconds

FAILED

Reason: TRANSFER [5] TRANSFER ERROR: Copy failed with mode 3rd push, with error: Transfer failure: Remote copy could not be performed (status: 110): \n

FINISHED

Duration: 159 seconds

FINISHED

Duration: 378 seconds

FINISHED

Duration: 19 seconds

FAILED

Reason: TRANSFER [5] TRANSFER ERROR: Copy failed with mode 3rd push, with error: Transfer failure: Remote copy could not be performed (status: 404): \n

FINISHED

Duration: 1070 seconds

Australia-SE

FAILED

Reason: SOURCE [2] Result HTTP 404 : File not found after 1 attempts

FAILED

Reason: SOURCE [2] Result HTTP 404 : File not found after 1 attempts

FAILED

Reason: SOURCE [2] Result HTTP 404 : File not found after 1 attempts

FAILED

Reason: SOURCE [2] Result HTTP 404 : File not found after 1 attempts

FAILED

Reason: SOURCE [2] Result HTTP 404 : File not found after 1 attempts

FAILED

Reason: SOURCE [2] Result HTTP 404 : File not found after 1 attempts

FAILED

Reason: SOURCE [2] Result HTTP 404 : File not found after 1 attempts

FAILED

Reason: SOURCE [2] Result HTTP 404 : File not found after 1 attempts

FAILED

Reason: SOURCE [2] Result HTTP 404 : File not found after 1 attempts

FAILED

Reason: SOURCE [2] Result HTTP 404 : File not found after 1 attempts

FAILED

Reason: SOURCE [2] Result HTTP 404 : File not found after 1 attempts

FAILED

Reason: SOURCE [2] Result HTTP 404 : File not found after 1 attempts

FAILED

Reason: SOURCE [2] Result HTTP 404 : File not found after 1 attempts

FAILED

Reason: SOURCE [2] Result HTTP 404 : File not found after 1 attempts

FAILED

Reason: SOURCE [2] Result HTTP 404 : File not found after 1 attempts

FAILED

Reason: SOURCE [2] Result HTTP 404 : File not found after 1 attempts

FAILED

Reason: SOURCE [2] Result HTTP 404 : File not found after 1 attempts

FAILED

Reason: SOURCE [2] Result HTTP 404 : File not found after 1 attempts

FAILED

Reason: SOURCE [2] Result HTTP 404 : File not found after 1 attempts

FAILED

Reason: SOURCE [2] Result HTTP 404 : File not found after 1 attempts

FAILED

Reason: SOURCE [2] Result HTTP 404 : File not found after 1 attempts

FAILED

Reason: SOURCE [2] Result HTTP 404 : File not found after 1 attempts

FAILED

Reason: SOURCE [2] Result HTTP 404 : File not found after 1 attempts

IHEP-TMP-SE

FAILED

Reason: TRANSFER [1] TRANSFER ERROR: Copy failed with mode 3rd push, with error: copy HTTP 403 : Permission refused

FAILED

Reason: TRANSFER [1] TRANSFER ERROR: Copy failed with mode 3rd push, with error: copy HTTP 403 : Permission refused

FAILED

Reason: TRANSFER [1] TRANSFER ERROR: Copy failed with mode 3rd push, with error: copy HTTP 403 : Permission refused

FAILED

Reason: TRANSFER [1] TRANSFER ERROR: Copy failed with mode 3rd push, with error: copy HTTP 403 : Permission refused

FAILED

Reason: TRANSFER [1] TRANSFER ERROR: Copy failed with mode 3rd push, with error: copy HTTP 403 : Permission refused

FAILED

Reason: TRANSFER [1] TRANSFER ERROR: Copy failed with mode 3rd push, with error: copy HTTP 403 : Permission refused

FAILED

Reason: TRANSFER [1] TRANSFER ERROR: Copy failed with mode 3rd push, with error: copy HTTP 403 : Permission refused

FAILED

Reason: TRANSFER [1] TRANSFER ERROR: Copy failed with mode 3rd push, with error: copy HTTP 403 : Permission refused

FAILED

Reason: TRANSFER [1] TRANSFER ERROR: Copy failed with mode 3rd push, with error: copy HTTP 403 : Permission refused

FAILED

Reason: TRANSFER [1] TRANSFER ERROR: Copy failed with mode 3rd push, with error: copy HTTP 403 : Permission refused

FAILED

Reason: TRANSFER [1] TRANSFER ERROR: Copy failed with mode 3rd push, with error: copy HTTP 403 : Permission refused

FAILED

Reason: TRANSFER [1] TRANSFER ERROR: Copy failed with mode 3rd push, with error: copy HTTP 403 : Permission refused

FAILED

Reason: TRANSFER [1] TRANSFER ERROR: Copy failed with mode 3rd push, with error: copy HTTP 403 : Permission refused

FAILED

Reason: TRANSFER [1] TRANSFER ERROR: Copy failed with mode 3rd push, with error: copy HTTP 403 : Permission refused

FAILED

Reason: TRANSFER [1] TRANSFER ERROR: Copy failed with mode 3rd push, with error: copy HTTP 403 : Permission refused

FAILED

Reason: TRANSFER [1] TRANSFER ERROR: Copy failed with mode 3rd push, with error: copy HTTP 403 : Permission refused

FAILED

Reason: TRANSFER [1] TRANSFER ERROR: Copy failed with mode 3rd push, with error: copy HTTP 403 : Permission refused

FAILED

Reason: TRANSFER [1] TRANSFER ERROR: Copy failed with mode 3rd push, with error: copy HTTP 403 : Permission refused

FAILED

Reason: TRANSFER [1] TRANSFER ERROR: Copy failed with mode 3rd push, with error: copy HTTP 403 : Permission refused

FAILED

Reason: TRANSFER [1] TRANSFER ERROR: Copy failed with mode 3rd push, with error: copy HTTP 403 : Permission refused

FAILED

Reason: TRANSFER [1] TRANSFER ERROR: Copy failed with mode 3rd push, with error: copy HTTP 403 : Permission refused

FAILED

Reason: TRANSFER [1] TRANSFER ERROR: Copy failed with mode 3rd push, with error: copy HTTP 403 : Permission refused

FAILED

Reason: TRANSFER [1] TRANSFER ERROR: Copy failed with mode 3rd push, with error: copy HTTP 403 : Permission refused

PULL TEST - DETAILS

DESTINATION

S

O

U

R

C

E

CNAF-TMP-SE

DESY-TMP-SE

IN2P3CC-TMP-SE

KIT-TMP-SE

Napoli-TMP-SE

UVic-TMP-SE1

CESNET-TMP-SE

IPHC-TMP-SE

LAL-TMP-SE

Pisa-TMP-SE

ROMA3-TMP-SE

Frascati-TMP-SE

CYFRONET-TMP-SE

ULAKBIM-TMP-SE

KEK-DEV-TMP-SE

SIGNET-TMP-SE

Torino-TMP-SE

MPPMU-TMP-SE

HEPHY-TMP-SE

NTUCC-TMP-SE

BNL-TMP-SE

UVic-TMP-SE-DYNA

Australia-SE

IHEP-TMP-SE

CNAF-TMP-SE

FINISHED

Duration: 15 seconds

FINISHED

Duration: 9 seconds

FINISHED

Duration: 12 seconds

FINISHED

Duration: 9 seconds

FINISHED

Duration: 17 seconds

FINISHED

Duration: 9 seconds

FINISHED

Duration: 460 seconds

FINISHED

Duration: 11 seconds

FINISHED

Duration: 14 seconds

FINISHED

Duration: 12 seconds

FINISHED

Duration: 9 seconds

FINISHED

Duration: 31 seconds

FINISHED

Duration: 26 seconds

FINISHED

Duration: 18 seconds

FINISHED

Duration: 9 seconds

FINISHED

Duration: 15 seconds

FINISHED

Duration: 87 seconds

FINISHED

Duration: 15 seconds

FAILED

Reason: TRANSFER [5] TRANSFER ERROR: Copy failed with mode 3rd pull, with error: Transfer failure: Truncated chunk ( expected size: 1048576; actual size: 737270)\n

FINISHED

Duration: 26 seconds

FAILED

Reason: TRANSFER [5] TRANSFER ERROR: Copy failed with mode 3rd pull, with error: Transfer failure: Remote copy could not be performed (status: 5): \n

FAILED

Reason: TRANSFER [2] TRANSFER ERROR: Copy failed with mode 3rd pull, with error: copy HTTP 404 : File not found

FAILED

Reason: TRANSFER [1] TRANSFER ERROR: Copy failed with mode 3rd pull, with error: copy HTTP 403 : Permission refused

DESY-TMP-SE

FINISHED

Duration: 22 seconds

FINISHED

Duration: 14 seconds

FINISHED

Duration: 12 seconds

FINISHED

Duration: 14 seconds

FAILED

Reason: TRANSFER [5] TRANSFER ERROR: Copy failed with mode 3rd pull, with error: Transfer failure: Post-processing failed: No such file or directory: 0000AF4A210BA2B64E09BFD3F5A2CE580886\n

FINISHED

Duration: 8 seconds

FINISHED

Duration: 644 seconds

FINISHED

Duration: 111 seconds

FINISHED

Duration: 18 seconds

FINISHED

Duration: 17 seconds

FINISHED

Duration: 19 seconds

FINISHED

Duration: 21 seconds

FINISHED

Duration: 28 seconds

FINISHED

Duration: 71 seconds

FINISHED

Duration: 19 seconds

FINISHED

Duration: 16 seconds

FINISHED

Duration: 928 seconds

FINISHED

Duration: 29 seconds

FINISHED

Duration: 106 seconds

FINISHED

Duration: 39 seconds

FAILED

Reason: TRANSFER [5] TRANSFER ERROR: Copy failed with mode 3rd pull, with error: Transfer failure: Remote copy could not be performed (status: 5): \n

FAILED

Reason: TRANSFER [2] TRANSFER ERROR: Copy failed with mode 3rd pull, with error: copy HTTP 404 : File not found

FAILED

Reason: TRANSFER [1] TRANSFER ERROR: Copy failed with mode 3rd pull, with error: copy HTTP 403 : Permission refused

IN2P3CC-TMP-SE

FINISHED

Duration: 32 seconds

FINISHED

Duration: 13 seconds

FINISHED

Duration: 7 seconds

FINISHED

Duration: 12 seconds

FAILED

Reason: TRANSFER [5] TRANSFER ERROR: Copy failed with mode 3rd pull, with error: Transfer failure: Post-processing failed: No such file or directory: 00003237010EDFAB4106912F2A79CA97A868\n

FINISHED

Duration: 8 seconds

FINISHED

Duration: 288 seconds

FINISHED

Duration: 15 seconds

FINISHED

Duration: 11 seconds

FINISHED

Duration: 11 seconds

FINISHED

Duration: 10 seconds

FINISHED

Duration: 18 seconds

FINISHED

Duration: 24 seconds

FINISHED

Duration: 39 seconds

FINISHED

Duration: 10 seconds

FINISHED

Duration: 13 seconds

FINISHED

Duration: 928 seconds

FINISHED

Duration: 19 seconds

FINISHED

Duration: 375 seconds

FINISHED

Duration: 37 seconds

FAILED

Reason: TRANSFER [5] TRANSFER ERROR: Copy failed with mode 3rd pull, with error: Transfer failure: Remote copy could not be performed (status: 409): \n

FAILED

Reason: TRANSFER [2] TRANSFER ERROR: Copy failed with mode 3rd pull, with error: copy HTTP 404 : File not found

FAILED

Reason: TRANSFER [1] TRANSFER ERROR: Copy failed with mode 3rd pull, with error: copy HTTP 403 : Permission refused

KIT-TMP-SE

FINISHED

Duration: 29 seconds

FINISHED

Duration: 12 seconds

FINISHED

Duration: 9 seconds

FINISHED

Duration: 13 seconds

FAILED

Reason: TRANSFER [5] TRANSFER ERROR: Copy failed with mode 3rd pull, with error: Transfer failure: Post-processing failed: No such file or directory: 000047D165281CD04F57A80AD3F3413DE131\n

FINISHED

Duration: 7 seconds

FINISHED

Duration: 472 seconds

FINISHED

Duration: 10 seconds

FINISHED

Duration: 13 seconds

FINISHED

Duration: 24 seconds

FINISHED

Duration: 16 seconds

FINISHED

Duration: 39 seconds

FINISHED

Duration: 22 seconds

FINISHED

Duration: 73 seconds

FINISHED

Duration: 21 seconds

FINISHED

Duration: 12 seconds

FINISHED

Duration: 786 seconds

FINISHED

Duration: 34 seconds

FINISHED

Duration: 1013 seconds

FINISHED

Duration: 40 seconds

FAILED

Reason: TRANSFER [5] TRANSFER ERROR: Copy failed with mode 3rd pull, with error: Transfer failure: Remote copy could not be performed (status: 5): \n

FAILED

Reason: TRANSFER [2] TRANSFER ERROR: Copy failed with mode 3rd pull, with error: copy HTTP 404 : File not found

FAILED

Reason: TRANSFER [1] TRANSFER ERROR: Copy failed with mode 3rd pull, with error: copy HTTP 403 : Permission refused

Napoli-TMP-SE

FINISHED

Duration: 31 seconds

FINISHED

Duration: 24 seconds

FINISHED

Duration: 13 seconds

FINISHED

Duration: 14 seconds

FAILED

Reason: TRANSFER [5] TRANSFER ERROR: Copy failed with mode 3rd pull, with error: Transfer failure: Post-processing failed: No such file or directory: 000019C452A26914451ABE31D9FC4F4BE0B6\n

FINISHED

Duration: 16 seconds

FINISHED

Duration: 453 seconds

FINISHED

Duration: 21 seconds

FINISHED

Duration: 16 seconds

FINISHED

Duration: 11 seconds

FINISHED

Duration: 6 seconds

FINISHED

Duration: 37 seconds

FINISHED

Duration: 30 seconds

FINISHED

Duration: 80 seconds

FINISHED

Duration: 17 seconds

FINISHED

Duration: 17 seconds

FINISHED

Duration: 1861 seconds

FINISHED

Duration: 16 seconds

FINISHED

Duration: 274 seconds

FINISHED

Duration: 40 seconds

FINISHED

Duration: 80 seconds

FAILED

Reason: TRANSFER [2] TRANSFER ERROR: Copy failed with mode 3rd pull, with error: copy HTTP 404 : File not found

FAILED

Reason: TRANSFER [1] TRANSFER ERROR: Copy failed with mode 3rd pull, with error: copy HTTP 403 : Permission refused

UVic-TMP-SE1

FINISHED

Duration: 34 seconds

FINISHED

Duration: 23 seconds

FINISHED

Duration: 21 seconds

FINISHED

Duration: 22 seconds

FINISHED

Duration: 7 seconds

FINISHED

Duration: 7 seconds

FINISHED

Duration: 268 seconds

FINISHED

Duration: 45 seconds

FINISHED

Duration: 12 seconds

FINISHED

Duration: 20 seconds

FINISHED

Duration: 24 seconds

FINISHED

Duration: 25 seconds

FINISHED

Duration: 31 seconds

FINISHED

Duration: 21 seconds

FINISHED

Duration: 23 seconds

FINISHED

Duration: 23 seconds

FINISHED

Duration: 81 seconds

FINISHED

Duration: 33 seconds

FINISHED

Duration: 418 seconds

FINISHED

Duration: 11 seconds

FINISHED

Duration: 4 seconds

FAILED

Reason: TRANSFER [2] TRANSFER ERROR: Copy failed with mode 3rd pull, with error: copy HTTP 404 : File not found

FAILED

Reason: TRANSFER [1] TRANSFER ERROR: Copy failed with mode 3rd pull, with error: copy HTTP 403 : Permission refused

CESNET-TMP-SE

FINISHED

Duration: 42 seconds

FINISHED

Duration: 12 seconds

FINISHED

Duration: 9 seconds

FINISHED

Duration: 13 seconds

FINISHED

Duration: 5 seconds

FAILED

Reason: TRANSFER [5] TRANSFER ERROR: Copy failed with mode 3rd pull, with error: Transfer failure: Post-processing failed: No such file or directory: 0000E2E86CC81F364B99AD1F6FA78EFC8B0E\n

FINISHED

Duration: 362 seconds

FINISHED

Duration: 42 seconds

FINISHED

Duration: 19 seconds

FINISHED

Duration: 12 seconds

FINISHED

Duration: 15 seconds

FINISHED

Duration: 14 seconds

FINISHED

Duration: 20 seconds

FINISHED

Duration: 33 seconds

FINISHED

Duration: 11 seconds

FINISHED

Duration: 12 seconds

FINISHED

Duration: 850 seconds

FINISHED

Duration: 16 seconds

FINISHED

Duration: 570 seconds

FINISHED

Duration: 37 seconds

FINISHED

Duration: 62 seconds

FAILED

Reason: TRANSFER [2] TRANSFER ERROR: Copy failed with mode 3rd pull, with error: copy HTTP 404 : File not found

FAILED

Reason: TRANSFER [1] TRANSFER ERROR: Copy failed with mode 3rd pull, with error: copy HTTP 403 : Permission refused

IPHC-TMP-SE

FINISHED

Duration: 38 seconds

FINISHED

Duration: 18 seconds

FINISHED

Duration: 7 seconds

FINISHED

Duration: 13 seconds

FINISHED

Duration: 13 seconds

FAILED

Reason: TRANSFER [5] TRANSFER ERROR: Copy failed with mode 3rd pull, with error: Transfer failure: Post-processing failed: No such file or directory: 00002E3683FD353D419A8A6382EA0B5CB884\n

FINISHED

Duration: 12 seconds

FINISHED

Duration: 31 seconds

FINISHED

Duration: 20 seconds

FINISHED

Duration: 13 seconds

FINISHED

Duration: 14 seconds

FINISHED

Duration: 45 seconds

FINISHED

Duration: 28 seconds

FINISHED

Duration: 54 seconds

FINISHED

Duration: 16 seconds

FINISHED

Duration: 14 seconds

FINISHED

Duration: 1285 seconds

FINISHED

Duration: 18 seconds

FINISHED

Duration: 364 seconds

FINISHED

Duration: 33 seconds

FINISHED

Duration: 70 seconds

FAILED

Reason: TRANSFER [2] TRANSFER ERROR: Copy failed with mode 3rd pull, with error: copy HTTP 404 : File not found

FAILED

Reason: TRANSFER [1] TRANSFER ERROR: Copy failed with mode 3rd pull, with error: copy HTTP 403 : Permission refused

LAL-TMP-SE

FINISHED

Duration: 36 seconds

FINISHED

Duration: 16 seconds

FINISHED

Duration: 7 seconds

FINISHED

Duration: 10 seconds

FINISHED

Duration: 13 seconds

FAILED

Reason: TRANSFER [5] TRANSFER ERROR: Copy failed with mode 3rd pull, with error: Transfer failure: Post-processing failed: No such file or directory: 0000DD3EB987F3F349DA98B266E8FE79CA46\n

FINISHED

Duration: 11 seconds

FINISHED

Duration: 260 seconds

FINISHED

Duration: 23 seconds

FINISHED

Duration: 19 seconds

FINISHED

Duration: 13 seconds

FINISHED

Duration: 43 seconds

FINISHED

Duration: 29 seconds

FINISHED

Duration: 52 seconds

FINISHED

Duration: 14 seconds

FINISHED

Duration: 15 seconds

FINISHED

Duration: 1266 seconds

FINISHED

Duration: 22 seconds

FINISHED

Duration: 376 seconds

FINISHED

Duration: 31 seconds

FAILED

Reason: TRANSFER [5] TRANSFER ERROR: Copy failed with mode 3rd pull, with error: Transfer failure: Remote copy could not be performed (status: 5): \n

FAILED

Reason: TRANSFER [2] TRANSFER ERROR: Copy failed with mode 3rd pull, with error: copy HTTP 404 : File not found

FAILED

Reason: TRANSFER [1] TRANSFER ERROR: Copy failed with mode 3rd pull, with error: copy HTTP 403 : Permission refused

Pisa-TMP-SE

FINISHED

Duration: 31 seconds

FINISHED

Duration: 16 seconds

FINISHED

Duration: 8 seconds

FINISHED

Duration: 14 seconds

FINISHED

Duration: 6 seconds

FAILED

Reason: TRANSFER [5] TRANSFER ERROR: Copy failed with mode 3rd pull, with error: Transfer failure: Post-processing failed: No such file or directory: 0000B85EA4B9975840C4893569AAEDB5AEDA\n

FINISHED

Duration: 9 seconds

FINISHED

Duration: 27 seconds

FINISHED

Duration: 11 seconds

FINISHED

Duration: 12 seconds

FINISHED

Duration: 5 seconds

FINISHED

Duration: 31 seconds

FINISHED

Duration: 28 seconds

FINISHED

Duration: 16 seconds

FINISHED

Duration: 16 seconds

FINISHED

Duration: 15 seconds

FINISHED

Duration: 9 seconds

FINISHED

Duration: 16 seconds

FAILED

Reason: TRANSFER [5] TRANSFER ERROR: Copy failed with mode 3rd pull, with error: Transfer failure: Truncated chunk ( expected size: 1048576; actual size: 786422)\n

FINISHED

Duration: 29 seconds

FAILED

Reason: TRANSFER [5] TRANSFER ERROR: Copy failed with mode 3rd pull, with error: Transfer failure: Remote copy could not be performed (status: 5): \n

FAILED

Reason: TRANSFER [2] TRANSFER ERROR: Copy failed with mode 3rd pull, with error: copy HTTP 404 : File not found

FAILED

Reason: TRANSFER [1] TRANSFER ERROR: Copy failed with mode 3rd pull, with error: copy HTTP 403 : Permission refused

ROMA3-TMP-SE

FINISHED

Duration: 32 seconds

FINISHED

Duration: 116 seconds

FINISHED

Duration: 11 seconds

FINISHED

Duration: 65 seconds

FINISHED

Duration: 6 seconds

FAILED

Reason: TRANSFER [5] TRANSFER ERROR: Copy failed with mode 3rd pull, with error: Transfer failure: Post-processing failed: No such file or directory: 0000F21AE207A727450DB2F87E33E48878A5\n

FINISHED

Duration: 8 seconds

FINISHED

Duration: 360 seconds

FINISHED

Duration: 13 seconds

FINISHED

Duration: 19 seconds

FINISHED

Duration: 6 seconds

FINISHED

Duration: 35 seconds

FINISHED

Duration: 26 seconds

FINISHED

Duration: 50 seconds

FINISHED

Duration: 12 seconds

FINISHED

Duration: 16 seconds

FINISHED

Duration: 106 seconds

FINISHED

Duration: 17 seconds

FAILED

Reason: TRANSFER [5] TRANSFER ERROR: Copy failed with mode 3rd pull, with error: Transfer failure: gridsrv-06.roma3.infn.it:8443 failed to respond\n

FINISHED

Duration: 31 seconds

FAILED

Reason: TRANSFER [5] TRANSFER ERROR: Copy failed with mode 3rd pull, with error: Transfer failure: Remote copy could not be performed (status: 409): \n

FAILED

Reason: TRANSFER [2] TRANSFER ERROR: Copy failed with mode 3rd pull, with error: copy HTTP 404 : File not found

FAILED

Reason: TRANSFER [1] TRANSFER ERROR: Copy failed with mode 3rd pull, with error: copy HTTP 403 : Permission refused

Frascati-TMP-SE

FINISHED

Duration: 34 seconds

FINISHED

Duration: 25 seconds

FINISHED

Duration: 14 seconds

FINISHED

Duration: 31 seconds

FINISHED

Duration: 7 seconds

FAILED

Reason: TRANSFER [5] TRANSFER ERROR: Copy failed with mode 3rd pull, with error: Transfer failure: Post-processing failed: No such file or directory: 0000627600032AC6495F88084593B3EEFD17\n

FINISHED

Duration: 13 seconds

FINISHED

Duration: 513 seconds

FINISHED

Duration: 96 seconds

FINISHED

Duration: 22 seconds

FINISHED

Duration: 12 seconds

FINISHED

Duration: 48 seconds

FINISHED

Duration: 29 seconds

FINISHED

Duration: 83 seconds

FINISHED

Duration: 31 seconds

FINISHED

Duration: 16 seconds

FINISHED

Duration: 1611 seconds

FINISHED

Duration: 13 seconds

FINISHED

Duration: 261 seconds

FINISHED

Duration: 44 seconds

FAILED

Reason: TRANSFER [5] TRANSFER ERROR: Copy failed with mode 3rd pull, with error: Transfer failure: Remote copy could not be performed (status: 409): \n

FAILED

Reason: TRANSFER [2] TRANSFER ERROR: Copy failed with mode 3rd pull, with error: copy HTTP 404 : File not found

FAILED

Reason: TRANSFER [1] TRANSFER ERROR: Copy failed with mode 3rd pull, with error: copy HTTP 403 : Permission refused

CYFRONET-TMP-SE

FINISHED

Duration: 133 seconds

FINISHED

Duration: 94 seconds

FINISHED

Duration: 102 seconds

FINISHED

Duration: 101 seconds

FINISHED

Duration: 128 seconds

FAILED

Reason: TRANSFER [5] TRANSFER ERROR: Copy failed with mode 3rd pull, with error: Transfer failure: Post-processing failed: No such file or directory: 0000B63194509A774934BABE691B5336A1CC\n

FINISHED

Duration: 108 seconds

FINISHED

Duration: 455 seconds

FINISHED

Duration: 108 seconds

FINISHED

Duration: 116 seconds

FINISHED

Duration: 145 seconds

FINISHED

Duration: 109 seconds

FINISHED

Duration: 114 seconds

FINISHED

Duration: 291 seconds

FINISHED

Duration: 168 seconds

FINISHED

Duration: 106 seconds

FINISHED

Duration: 1495 seconds

FINISHED

Duration: 108 seconds

FINISHED

Duration: 451 seconds

FINISHED

Duration: 173 seconds

FAILED

Reason: TRANSFER [5] TRANSFER ERROR: Copy failed with mode 3rd pull, with error: Transfer failure: Remote copy could not be performed (status: 409): \n

FAILED

Reason: TRANSFER [2] TRANSFER ERROR: Copy failed with mode 3rd pull, with error: copy HTTP 404 : File not found

FAILED

Reason: TRANSFER [1] TRANSFER ERROR: Copy failed with mode 3rd pull, with error: copy HTTP 403 : Permission refused

ULAKBIM-TMP-SE

FINISHED

Duration: 56 seconds

FINISHED

Duration: 24 seconds

FINISHED

Duration: 22 seconds

FINISHED

Duration: 18 seconds

FINISHED

Duration: 28 seconds

FAILED

Reason: TRANSFER [5] TRANSFER ERROR: Copy failed with mode 3rd pull, with error: Transfer failure: Post-processing failed: No such file or directory: 0000383EDBB77CEB4FE99CFB7EADB851D4CF\n

FINISHED

Duration: 16 seconds

FINISHED

Duration: 353 seconds

FINISHED

Duration: 26 seconds

FINISHED

Duration: 21 seconds

FINISHED

Duration: 21 seconds

FINISHED

Duration: 29 seconds

FINISHED

Duration: 47 seconds

FINISHED

Duration: 61 seconds

FINISHED

Duration: 18 seconds

FINISHED

Duration: 25 seconds

ACTIVE

Reason:

FINISHED

Duration: 21 seconds

FINISHED

Duration: 164 seconds

FINISHED

Duration: 54 seconds

FAILED

Reason: TRANSFER [5] TRANSFER ERROR: Copy failed with mode 3rd pull, with error: Transfer failure: Remote copy could not be performed (status: 5): \n

FAILED

Reason: TRANSFER [2] TRANSFER ERROR: Copy failed with mode 3rd pull, with error: copy HTTP 404 : File not found

FAILED

Reason: TRANSFER [1] TRANSFER ERROR: Copy failed with mode 3rd pull, with error: copy HTTP 403 : Permission refused

KEK-DEV-TMP-SE

FINISHED

Duration: 32 seconds

FINISHED

Duration: 61 seconds

FINISHED

Duration: 65 seconds

FINISHED

Duration: 63 seconds

FINISHED

Duration: 70 seconds

FAILED

Reason: TRANSFER [5] TRANSFER ERROR: Copy failed with mode 3rd pull, with error: Transfer failure: Post-processing failed: No such file or directory: 0000FC6424CFED3B4809B6D09DB9615D8B7C\n

FINISHED

Duration: 20 seconds

FINISHED

Duration: 308 seconds

FINISHED

Duration: 64 seconds

FINISHED

Duration: 19 seconds

FINISHED

Duration: 54 seconds

FINISHED

Duration: 74 seconds

FINISHED

Duration: 75 seconds

FINISHED

Duration: 164 seconds

FINISHED

Duration: 68 seconds

FINISHED

Duration: 67 seconds

ACTIVE

Reason:

FINISHED

Duration: 82 seconds

FINISHED

Duration: 91 seconds

FINISHED

Duration: 52 seconds

FAILED

Reason: TRANSFER [5] TRANSFER ERROR: Copy failed with mode 3rd pull, with error: Transfer failure: Remote copy could not be performed (status: 5): \n

FAILED

Reason: TRANSFER [2] TRANSFER ERROR: Copy failed with mode 3rd pull, with error: copy HTTP 404 : File not found

FAILED

Reason: TRANSFER [1] TRANSFER ERROR: Copy failed with mode 3rd pull, with error: copy HTTP 403 : Permission refused

SIGNET-TMP-SE

FINISHED

Duration: 1084 seconds

FINISHED

Duration: 72 seconds

FINISHED

Duration: 68 seconds

FINISHED

Duration: 182 seconds

FINISHED

Duration: 67 seconds

FAILED

Reason: TRANSFER [5] TRANSFER ERROR: Copy failed with mode 3rd pull, with error: Transfer failure: Post-processing failed: No such file or directory: 0000DBEC9CA34AE447849B2A68EE2C54FCC9\n

FINISHED

Duration: 201 seconds

FINISHED

Duration: 371 seconds

FINISHED

Duration: 666 seconds

FINISHED

Duration: 81 seconds

FINISHED

Duration: 41 seconds

FINISHED

Duration: 101 seconds

FINISHED

Duration: 350 seconds

FINISHED

Duration: 139 seconds

FINISHED

Duration: 1377 seconds

FAILED

Reason: TRANSFER [5] TRANSFER ERROR: Copy failed with mode 3rd pull, with error: Transfer failure: SocketTimeoutException while fetching https://dcache.ijs.si:2880/pnfs/ijs.si/belle/TMP/belle/test/TPC/1G-test?copy_mode=pull: Read timed out

ACTIVE

Reason:

FINISHED

Duration: 675 seconds

FINISHED

Duration: 1804 seconds

FINISHED

Duration: 498 seconds

FAILED

Reason: TRANSFER [5] TRANSFER ERROR: Copy failed with mode 3rd pull, with error: Transfer failure: Remote copy could not be performed (status: 110): \n

FAILED

Reason: TRANSFER [2] TRANSFER ERROR: Copy failed with mode 3rd pull, with error: copy HTTP 404 : File not found

FAILED

Reason: TRANSFER [1] TRANSFER ERROR: Copy failed with mode 3rd pull, with error: copy HTTP 403 : Permission refused

Torino-TMP-SE

FINISHED

Duration: 35 seconds

FINISHED

Duration: 17 seconds

FINISHED

Duration: 8 seconds

FINISHED

Duration: 15 seconds

FINISHED

Duration: 8 seconds

FAILED

Reason: TRANSFER [5] TRANSFER ERROR: Copy failed with mode 3rd pull, with error: Transfer failure: Post-processing failed: No such file or directory: 00003096667C7F1540A4961054ED6CABC7B6\n

FINISHED

Duration: 11 seconds

FINISHED

Duration: 493 seconds

FINISHED

Duration: 11 seconds

FINISHED

Duration: 22 seconds

FINISHED

Duration: 12 seconds

FINISHED

Duration: 6 seconds

FINISHED

Duration: 31 seconds

FINISHED

Duration: 28 seconds

FINISHED

Duration: 62 seconds

FINISHED

Duration: 10 seconds

FINISHED

Duration: 1233 seconds

FINISHED

Duration: 14 seconds

FINISHED

Duration: 188 seconds

FINISHED

Duration: 37 seconds

FAILED

Reason: TRANSFER [5] TRANSFER ERROR: Copy failed with mode 3rd pull, with error: Transfer failure: Remote copy could not be performed (status: 409): \n

FAILED

Reason: TRANSFER [2] TRANSFER ERROR: Copy failed with mode 3rd pull, with error: copy HTTP 404 : File not found

FAILED

Reason: TRANSFER [1] TRANSFER ERROR: Copy failed with mode 3rd pull, with error: copy HTTP 403 : Permission refused

MPPMU-TMP-SE

FINISHED

Duration: 28 seconds

FINISHED

Duration: 7 seconds

FINISHED

Duration: 15 seconds

FINISHED

Duration: 40 seconds

FINISHED

Duration: 29 seconds

FAILED

Reason: TRANSFER [5] TRANSFER ERROR: Copy failed with mode 3rd pull, with error: Transfer failure: Post-processing failed: No such file or directory: 0000666B8AD717DA4827AC55045754BEE7F1\n

FINISHED

Duration: 7 seconds

FINISHED

Duration: 459 seconds

FINISHED

Duration: 13 seconds

FINISHED

Duration: 20 seconds

FINISHED

Duration: 17 seconds

FINISHED

Duration: 15 seconds

FINISHED

Duration: 18 seconds

FINISHED

Duration: 26 seconds

FINISHED

Duration: 57 seconds

FINISHED

Duration: 21 seconds

FINISHED

Duration: 16 seconds

FINISHED

Duration: 42 seconds

FINISHED

Duration: 393 seconds

FINISHED

Duration: 37 seconds

FAILED

Reason: TRANSFER [5] TRANSFER ERROR: Copy failed with mode 3rd pull, with error: Transfer failure: Remote copy could not be performed (status: 409): \n

FAILED

Reason: TRANSFER [2] TRANSFER ERROR: Copy failed with mode 3rd pull, with error: copy HTTP 404 : File not found

FAILED

Reason: TRANSFER [1] TRANSFER ERROR: Copy failed with mode 3rd pull, with error: copy HTTP 403 : Permission refused

HEPHY-TMP-SE

FAILED

Reason: TRANSFER [5] TRANSFER ERROR: Copy failed with mode 3rd pull, with error: Transfer failure: SocketTimeoutException while fetching https://eos.grid.vbc.ac.at:8443/eos/vbc/experiments/belle/TMP/belle/test/TPC/1G-test?copy_mode=pull: Read timed out

FINISHED

Duration: 13 seconds

FINISHED

Duration: 11 seconds

FINISHED

Duration: 25 seconds

FINISHED

Duration: 12 seconds

FINISHED

Duration: 49 seconds

FINISHED

Duration: 14 seconds

FINISHED

Duration: 466 seconds

FINISHED

Duration: 91 seconds

FAILED

Reason: TRANSFER [5] TRANSFER ERROR: Copy failed with mode 3rd pull, with error: Transfer failure: SocketTimeoutException while fetching https://eos.grid.vbc.ac.at:8443/eos/vbc/experiments/belle/TMP/belle/test/TPC/1G-test?copy_mode=pull: Read timed out

FAILED

Reason: TRANSFER [5] TRANSFER ERROR: Copy failed with mode 3rd pull, with error: Transfer failure: SocketTimeoutException while fetching https://eos.grid.vbc.ac.at:8443/eos/vbc/experiments/belle/TMP/belle/test/TPC/1G-test?copy_mode=pull: Read timed out

FINISHED

Duration: 12 seconds

FINISHED

Duration: 38 seconds

FINISHED

Duration: 33 seconds

FINISHED

Duration: 60 seconds

FINISHED

Duration: 10 seconds

FAILED

Reason: TRANSFER [5] TRANSFER ERROR: Copy failed with mode 3rd pull, with error: Transfer failure: SocketTimeoutException while fetching https://eos.grid.vbc.ac.at:8443/eos/vbc/experiments/belle/TMP/belle/test/TPC/1G-test?copy_mode=pull: Read timed out

FINISHED

Duration: 63 seconds

FAILED

Reason: TRANSFER [5] TRANSFER ERROR: Copy failed with mode 3rd pull, with error: Transfer failure: fst-5.eos.grid.vbc.ac.at:9001 failed to respond; redirects [https://fst-5.eos.grid.vbc.ac.at:9001/eos/vbc/experiments/belle/TMP/belle/test/TPC/1G-test?encURI=%26cap.sym%3DTU8aiZKgP9JVwZSe2%2FtlKPrdWfk%3D%26cap.msg%3D3nbHSbN5UOFAk%2FeRkrrmP8ZgCi4h4ZJ20MdgUX3KcgxDGkgml3dGoB9L9aO1Jra%2BWFXLNMFOsA0Y6vTnyEEPkDIpvvMHCcUMAilAXJGkd0KiuRG7qAmQbaOhjQEtbvHcAnlzAgKRnJ5LuW29WjB84gdO%2BSG7v%2B0HbQMdrTexB0FEgQsgN4WZHnH88Bv8Ffbn7SoWyuzPznuwFVUGhJLVyay2qOnigg%2FSnHaMQynhKjkJxaEtLT4erpc%2FTE1UVmYEQsLvvb%2F

FINISHED

Duration: 46 seconds

FAILED

Reason: TRANSFER [5] TRANSFER ERROR: Copy failed with mode 3rd pull, with error: Transfer failure: Remote copy could not be performed (status: 5): \n

FAILED

Reason: TRANSFER [2] TRANSFER ERROR: Copy failed with mode 3rd pull, with error: copy HTTP 404 : File not found

FAILED

Reason: TRANSFER [1] TRANSFER ERROR: Copy failed with mode 3rd pull, with error: copy HTTP 403 : Permission refused

NTUCC-TMP-SE

FINISHED

Duration: 236 seconds

FINISHED

Duration: 232 seconds

FINISHED

Duration: 211 seconds

FINISHED

Duration: 232 seconds

FINISHED

Duration: 173 seconds

FAILED

Reason: TRANSFER [5] TRANSFER ERROR: Copy failed with mode 3rd pull, with error: Transfer failure: Certificate for doesn't match any of the subject alternative names: [john@hep1.phys.ntu.edu.tw]\n

FINISHED

Duration: 176 seconds

FINISHED

Duration: 676 seconds

FINISHED

Duration: 218 seconds

FINISHED

Duration: 141 seconds

FINISHED

Duration: 167 seconds

FINISHED

Duration: 234 seconds

FINISHED

Duration: 207 seconds

FINISHED

Duration: 211 seconds

FINISHED

Duration: 69 seconds

FINISHED

Duration: 208 seconds

FINISHED

Duration: 175 seconds

FINISHED

Duration: 412 seconds

ACTIVE

Reason:

FINISHED

Duration: 101 seconds

FINISHED

Duration: 170 seconds

FAILED

Reason: TRANSFER [2] TRANSFER ERROR: Copy failed with mode 3rd pull, with error: copy HTTP 404 : File not found

FAILED

Reason: TRANSFER [1] TRANSFER ERROR: Copy failed with mode 3rd pull, with error: copy HTTP 403 : Permission refused

BNL-TMP-SE

FINISHED

Duration: 49 seconds

FINISHED

Duration: 35 seconds

FINISHED

Duration: 37 seconds

FINISHED

Duration: 37 seconds

FINISHED

Duration: 19 seconds

FAILED

Reason: TRANSFER [5] TRANSFER ERROR: Copy failed with mode 3rd pull, with error: Transfer failure: Post-processing failed: No such file or directory: 00009346A0120D054676B61D4BAF743508D4\n

FINISHED

Duration: 17 seconds

FINISHED

Duration: 217 seconds

FINISHED

Duration: 40 seconds

FINISHED

Duration: 23 seconds

FINISHED

Duration: 29 seconds

FINISHED

Duration: 42 seconds

FINISHED

Duration: 57 seconds

FINISHED

Duration: 54 seconds

FINISHED

Duration: 34 seconds

FINISHED

Duration: 42 seconds

FINISHED

Duration: 39 seconds

ACTIVE

Reason:

FINISHED

Duration: 42 seconds

FINISHED

Duration: 734 seconds

FINISHED

Duration: 32 seconds

FAILED

Reason: TRANSFER [2] TRANSFER ERROR: Copy failed with mode 3rd pull, with error: copy HTTP 404 : File not found

FAILED

Reason: TRANSFER [1] TRANSFER ERROR: Copy failed with mode 3rd pull, with error: copy HTTP 403 : Permission refused

UVic-TMP-SE-DYNA

FAILED

Reason: TRANSFER [5] TRANSFER ERROR: Copy failed with mode 3rd pull, with error: Transfer failure: Error fetching https://dynafed02.heprc.uvic.ca:8443/dynafed/TMP/belle/test/TPC/1G-test?copy_mode=pull: 401 status code: 401, reason phrase: login failed

FAILED

Reason: TRANSFER [5] TRANSFER ERROR: Copy failed with mode 3rd pull, with error: Transfer failure: rejected GET: 401 login failed; redirects [https://basilisk02.westgrid.ca:2880/belledisk/TMP/belle/test/TPC/1G-test]\n

FAILED

Reason: TRANSFER [5] TRANSFER ERROR: Copy failed with mode 3rd pull, with error: Transfer failure: rejected GET: 401 login failed; redirects [https://basilisk02.westgrid.ca:2880/belledisk/TMP/belle/test/TPC/1G-test]\n

FAILED

Reason: TRANSFER [5] TRANSFER ERROR: Copy failed with mode 3rd pull, with error: Transfer failure: rejected GET: 401 login failed; redirects [https://basilisk02.westgrid.ca:2880/belledisk/TMP/belle/test/TPC/1G-test]\n

FAILED

Reason: TRANSFER [5] TRANSFER ERROR: Copy failed with mode 3rd pull, with error: Transfer failure: Remote copy failed with status code 401: Found\n

FAILED

Reason: TRANSFER [5] TRANSFER ERROR: Copy failed with mode 3rd pull, with error: Transfer failure: rejected GET: 401 login failed; redirects [https://basilisk02.westgrid.ca:2880/belledisk/TMP/belle/test/TPC/1G-test]\n

FAILED

Reason: TRANSFER [5] TRANSFER ERROR: Copy failed with mode 3rd pull, with error: Transfer failure: rejected GET: 401 login failed; redirects [https://basilisk02.westgrid.ca:2880/belledisk/TMP/belle/test/TPC/1G-test]\n

FAILED

Reason: TRANSFER [5] TRANSFER ERROR: Copy failed with mode 3rd pull, with error: Transfer failure: Remote copy failed with status code 401: Found\n

FAILED

Reason: TRANSFER [5] TRANSFER ERROR: Copy failed with mode 3rd pull, with error: Transfer failure: Remote copy failed with status code 401: Found\n

FAILED

Reason: TRANSFER [5] TRANSFER ERROR: Copy failed with mode 3rd pull, with error: Transfer failure: Error fetching https://dynafed02.heprc.uvic.ca:8443/dynafed/TMP/belle/test/TPC/1G-test?copy_mode=pull: 401 status code: 401, reason phrase: login failed

FAILED

Reason: TRANSFER [5] TRANSFER ERROR: Copy failed with mode 3rd pull, with error: Transfer failure: Error fetching https://dynafed02.heprc.uvic.ca:8443/dynafed/TMP/belle/test/TPC/1G-test?copy_mode=pull: 401 status code: 401, reason phrase: login failed

FAILED

Reason: TRANSFER [5] TRANSFER ERROR: Copy failed with mode 3rd pull, with error: Transfer failure: Remote copy failed with status code 401: Found\n

FAILED

Reason: TRANSFER [5] TRANSFER ERROR: Copy failed with mode 3rd pull, with error: Transfer failure: Remote copy failed with status code 401: Found\n

FAILED

Reason: TRANSFER [5] TRANSFER ERROR: Copy failed with mode 3rd pull, with error: Transfer failure: Remote copy failed with status code 401: \n

FAILED

Reason: TRANSFER [5] TRANSFER ERROR: Copy failed with mode 3rd pull, with error: Transfer failure: Error fetching https://dynafed02.heprc.uvic.ca:8443/dynafed/TMP/belle/test/TPC/1G-test?copy_mode=pull: 401 status code: 401, reason phrase: login failed

FAILED

Reason: TRANSFER [5] TRANSFER ERROR: Copy failed with mode 3rd pull, with error: Transfer failure: rejected GET: 401 login failed; redirects [https://basilisk02.westgrid.ca:2880/belledisk/TMP/belle/test/TPC/1G-test]\n

FAILED

Reason: TRANSFER [5] TRANSFER ERROR: Copy failed with mode 3rd pull, with error: Transfer failure: Error fetching https://dynafed02.heprc.uvic.ca:8443/dynafed/TMP/belle/test/TPC/1G-test?copy_mode=pull: 401 status code: 401, reason phrase: login failed

FAILED

Reason: TRANSFER [5] TRANSFER ERROR: Copy failed with mode 3rd pull, with error: Transfer failure: rejected GET: 401 login failed; redirects [https://basilisk02.westgrid.ca:2880/belledisk/TMP/belle/test/TPC/1G-test]\n

FAILED

Reason: TRANSFER [5] TRANSFER ERROR: Copy failed with mode 3rd pull, with error: Transfer failure: Remote side failed with status code 401; error message: " Error 401 login failed

HTTP ERROR 401

Problem accessing /belledisk/TMP/belle/test/TPC/1G-test. Reason:

    login failed


Powered by Jetty:// 9.4.18.v20190429
"

FAILED

Reason: TRANSFER [5] TRANSFER ERROR: Copy failed with mode 3rd pull, with error: Transfer failure: rejected GET: 401 login failed; redirects [https://basilisk02.westgrid.ca:2880/belledisk/TMP/belle/test/TPC/1G-test]\n

FAILED

Reason: TRANSFER [5] TRANSFER ERROR: Copy failed with mode 3rd pull, with error: Transfer failure: rejected GET: 401 login failed; redirects [https://basilisk02.westgrid.ca:2880/belledisk/TMP/belle/test/TPC/1G-test]\n

FAILED

Reason: TRANSFER [2] TRANSFER ERROR: Copy failed with mode 3rd pull, with error: copy HTTP 404 : File not found

FAILED

Reason: TRANSFER [1] TRANSFER ERROR: Copy failed with mode 3rd pull, with error: copy HTTP 403 : Permission refused

Australia-SE

FAILED

Reason: SOURCE [2] Result HTTP 404 : File not found after 1 attempts

FAILED

Reason: SOURCE [2] Result HTTP 404 : File not found after 1 attempts

FAILED

Reason: SOURCE [2] Result HTTP 404 : File not found after 1 attempts

FAILED

Reason: SOURCE [2] Result HTTP 404 : File not found after 1 attempts

FAILED

Reason: SOURCE [2] Result HTTP 404 : File not found after 1 attempts

FAILED

Reason: SOURCE [2] Result HTTP 404 : File not found after 1 attempts

FAILED

Reason: SOURCE [2] Result HTTP 404 : File not found after 1 attempts

FAILED

Reason: SOURCE [2] Result HTTP 404 : File not found after 1 attempts

FAILED

Reason: SOURCE [2] Result HTTP 404 : File not found after 1 attempts

FAILED

Reason: SOURCE [2] Result HTTP 404 : File not found after 1 attempts

FAILED

Reason: SOURCE [2] Result HTTP 404 : File not found after 1 attempts

FAILED

Reason: SOURCE [2] Result HTTP 404 : File not found after 1 attempts

FAILED

Reason: SOURCE [2] Result HTTP 404 : File not found after 1 attempts

FAILED

Reason: SOURCE [2] Result HTTP 404 : File not found after 1 attempts

FAILED

Reason: SOURCE [2] Result HTTP 404 : File not found after 1 attempts

FAILED

Reason: SOURCE [2] Result HTTP 404 : File not found after 1 attempts

FAILED

Reason: SOURCE [2] Result HTTP 404 : File not found after 1 attempts

FAILED

Reason: SOURCE [2] Result HTTP 404 : File not found after 1 attempts

FAILED

Reason: SOURCE [2] Result HTTP 404 : File not found after 1 attempts

FAILED

Reason: SOURCE [2] Result HTTP 404 : File not found after 1 attempts

FAILED

Reason: SOURCE [2] Result HTTP 404 : File not found after 1 attempts

FAILED

Reason: SOURCE [2] Result HTTP 404 : File not found after 1 attempts

FAILED

Reason: SOURCE [2] Result HTTP 404 : File not found after 1 attempts

IHEP-TMP-SE

FINISHED

Duration: 92 seconds

FINISHED

Duration: 65 seconds

FAILED

Reason: TRANSFER [5] TRANSFER ERROR: Copy failed with mode 3rd pull, with error: Transfer failure: rejected GET: 403 Forbidden; redirects [https://dpmbelle01.ihep.ac.cn:443/storage/belle01_02/belle/2021-11-10/1G-test.7014487.1636474089?token=TXXviFxLsiutjXpSvwyVcbPLwpA%3D%401657085111%400&dav_sfn=%2Fdpm%2Fihep.ac.cn%2Fhome%2Fbelle%2FTMP%2Fbelle%2Ftest%2FTPC%2F1G-test&dav_user=%2FDC%3Dorg%2FDC%3Dterena%2FDC%3Dtcs%2FC%3DIT%2FO%3DIstituto%20Nazionale%20di%20Fisica%20Nucleare%2FCN%3DSilvio%20Pardi%20spardi%40infn.it]\n

FAILED

Reason: TRANSFER [5] TRANSFER ERROR: Copy failed with mode 3rd pull, with error: Transfer failure: rejected GET: 403 Forbidden; redirects [https://dpmbelle01.ihep.ac.cn:443/storage/belle01_02/belle/2021-11-10/1G-test.7014487.1636474089?token=ZVgQimNsMaT%2BIq5ulunK%2Ffc4y%2Fs%3D%401657085115%400&dav_sfn=%2Fdpm%2Fihep.ac.cn%2Fhome%2Fbelle%2FTMP%2Fbelle%2Ftest%2FTPC%2F1G-test&dav_user=%2FDC%3Dorg%2FDC%3Dterena%2FDC%3Dtcs%2FC%3DIT%2FO%3DIstituto%20Nazionale%20di%20Fisica%20Nucleare%2FCN%3DSilvio%20Pardi%20spardi%40infn.it]\n

FAILED

Reason: TRANSFER [5] TRANSFER ERROR: Copy failed with mode 3rd pull, with error: Transfer failure: Remote copy failed with status code 403: Found\n

FAILED

Reason: TRANSFER [5] TRANSFER ERROR: Copy failed with mode 3rd pull, with error: Transfer failure: Post-processing failed: No such file or directory: 00006E82203E29E34561A76399C760EE2482\n

FINISHED

Duration: 55 seconds

FAILED

Reason: TRANSFER [5] TRANSFER ERROR: Copy failed with mode 3rd pull, with error: Transfer failure: Remote copy failed with status code 403: Found\n

FAILED

Reason: TRANSFER [5] TRANSFER ERROR: Copy failed with mode 3rd pull, with error: Transfer failure: Remote copy failed with status code 403: Found\n

FINISHED

Duration: 51 seconds

FINISHED

Duration: 64 seconds

FAILED

Reason: TRANSFER [5] TRANSFER ERROR: Copy failed with mode 3rd pull, with error: Transfer failure: Remote copy failed with status code 403: Found\n

FAILED

Reason: TRANSFER [5] TRANSFER ERROR: Copy failed with mode 3rd pull, with error: Transfer failure: Remote copy failed with status code 403: Found\n

FAILED

Reason: TRANSFER [5] TRANSFER ERROR: Copy failed with mode 3rd pull, with error: Transfer failure: Remote copy failed with status code 403: \n

FINISHED

Duration: 100 seconds

FAILED

Reason: TRANSFER [5] TRANSFER ERROR: Copy failed with mode 3rd pull, with error: Transfer failure: rejected GET: 403 Forbidden; redirects [https://dpmbelle01.ihep.ac.cn:443/storage/belle01_02/belle/2021-11-10/1G-test.7014487.1636474089?token=6K%2Bt2ORwzg5ZLegjaS2z4RGjAEQ%3D%401657085134%400&dav_sfn=%2Fdpm%2Fihep.ac.cn%2Fhome%2Fbelle%2FTMP%2Fbelle%2Ftest%2FTPC%2F1G-test&dav_user=%2FDC%3Dorg%2FDC%3Dterena%2FDC%3Dtcs%2FC%3DIT%2FO%3DIstituto%20Nazionale%20di%20Fisica%20Nucleare%2FCN%3DSilvio%20Pardi%20spardi%40infn.it]\n

FINISHED

Duration: 66 seconds

FAILED

Reason: TRANSFER [5] TRANSFER ERROR: Copy failed with mode 3rd pull, with error: Transfer failure: rejected GET: 403 Forbidden; redirects [https://dpmbelle01.ihep.ac.cn:443/storage/belle01_02/belle/2021-11-10/1G-test.7014487.1636474089?token=ez%2Bt1eHDeZVJRz%2BRaymjxqNYxjk%3D%401657085133%400&dav_sfn=%2Fdpm%2Fihep.ac.cn%2Fhome%2Fbelle%2FTMP%2Fbelle%2Ftest%2FTPC%2F1G-test&dav_user=%2FDC%3Dorg%2FDC%3Dterena%2FDC%3Dtcs%2FC%3DIT%2FO%3DIstituto%20Nazionale%20di%20Fisica%20Nucleare%2FCN%3DSilvio%20Pardi%20spardi%40infn.it]\n

FINISHED

Duration: 66 seconds

FINISHED

Duration: 371 seconds

FINISHED

Duration: 142 seconds

FAILED

Reason: TRANSFER [5] TRANSFER ERROR: Copy failed with mode 3rd pull, with error: Transfer failure: Remote copy could not be performed (status: 409): \n

FAILED

Reason: TRANSFER [2] TRANSFER ERROR: Copy failed with mode 3rd pull, with error: copy HTTP 404 : File not found